148>------ Build started: Project: test-extensions, Configuration: Release x64 ------
148>Building Custom Rule C:/GitHub/hifi/tests/CMakeLists.txt
148>CMake does not need to re-run because C:/GitHub/hifi/build/tests/CMakeFiles/generate.stamp is up-to-date.
149>------ Skipped Build: Project: ktx-tests, Configuration: Release x64 ------
149>Project not selected to build for this solution configuration
150>------ Skipped Build: Project: jitter-tests, Configuration: Release x64 ------
150>Project not selected to build for this solution configuration
151>------ Skipped Build: Project: workload-tests, Configuration: Release x64 ------
151>Project not selected to build for this solution configuration
152>------ Skipped Build: Project: all-tests, Configuration: Release x64 ------
152>Project not selected to build for this solution configuration
153>------ Skipped Build: Project: packaged-server-console, Configuration: Release x64 ------
153>Project not selected to build for this solution configuration
154>------ Skipped Build: Project: RUN_TESTS, Configuration: Release x64 ------
154>Project not selected to build for this solution configuration
155>------ Skipped Build: Project: cmake, Configuration: Release x64 ------
155>Project not selected to build for this solution configuration
156>------ Skipped Build: Project: Nightly, Configuration: Release x64 ------
156>Project not selected to build for this solution configuration
157>------ Skipped Build: Project: NightlyMemoryCheck, Configuration: Release x64 ------
157>Project not selected to build for this solution configuration
158>------ Skipped Build: Project: Experimental, Configuration: Release x64 ------
158>Project not selected to build for this solution configuration
159>------ Skipped Build: Project: Continuous, Configuration: Release x64 ------
159>Project not selected to build for this solution configuration
160>------ Skipped Build: Project: scribe_shaders, Configuration: Release x64 ------
160>Project not selected to build for this solution configuration
161>------ Skipped Build: Project: qmls, Configuration: Release x64 ------
161>Project not selected to build for this solution configuration
162>------ Skipped Build: Project: udt-test, Configuration: Release x64 ------
162>Project not selected to build for this solution configuration
163>------ Skipped Build: Project: js, Configuration: Release x64 ------
163>Project not selected to build for this solution configuration
89>Error copying directory from "C:/GitHub/hifi/tools/jsdoc/out" to "C:/GitHub/hifi/build/interface/Release/jsdoc".
89>C:\Program Files (x86)\Microsoft Visual Studio\2017\Community\Common7\IDE\VC\VCTargets\Microsoft.CppCommon.targets(138,5): error MSB3073: The command "setlocal
89>C:\Program Files (x86)\Microsoft Visual Studio\2017\Community\Common7\IDE\VC\VCTargets\Microsoft.CppCommon.targets(138,5): error MSB3073: "C:\Program Files\CMake\bin\cmake.exe" -E copy_if_different C:/GitHub/hifi/interface/compiledResources/resources.rcc C:/GitHub/hifi/build/interface/Release
89>C:\Program Files (x86)\Microsoft Visual Studio\2017\Community\Common7\IDE\VC\VCTargets\Microsoft.CppCommon.targets(138,5): error MSB3073: if %errorlevel% neq 0 goto :cmEnd
89>C:\Program Files (x86)\Microsoft Visual Studio\2017\Community\Common7\IDE\VC\VCTargets\Microsoft.CppCommon.targets(138,5): error MSB3073: "C:\Program Files\CMake\bin\cmake.exe" -E copy_directory C:/GitHub/hifi/interface/resources/fonts C:/GitHub/hifi/build/interface/Release/resources/fonts
89>C:\Program Files (x86)\Microsoft Visual Studio\2017\Community\Common7\IDE\VC\VCTargets\Microsoft.CppCommon.targets(138,5): error MSB3073: if %errorlevel% neq 0 goto :cmEnd
89>C:\Program Files (x86)\Microsoft Visual Studio\2017\Community\Common7\IDE\VC\VCTargets\Microsoft.CppCommon.targets(138,5): error MSB3073: "C:\Program Files\CMake\bin\cmake.exe" -E copy_directory C:/GitHub/hifi/scripts C:/GitHub/hifi/build/interface/Release/scripts
89>C:\Program Files (x86)\Microsoft Visual Studio\2017\Community\Common7\IDE\VC\VCTargets\Microsoft.CppCommon.targets(138,5): error MSB3073: if %errorlevel% neq 0 goto :cmEnd
89>C:\Program Files (x86)\Microsoft Visual Studio\2017\Community\Common7\IDE\VC\VCTargets\Microsoft.CppCommon.targets(138,5): error MSB3073: "C:\Program Files\CMake\bin\cmake.exe" -E copy_if_different C:/GitHub/hifi/interface/resources/serverless/tutorial.json C:/GitHub/hifi/build/interface/Release/resources/serverless/tutorial.json
89>C:\Program Files (x86)\Microsoft Visual Studio\2017\Community\Common7\IDE\VC\VCTargets\Microsoft.CppCommon.targets(138,5): error MSB3073: if %errorlevel% neq 0 goto :cmEnd
89>C:\Program Files (x86)\Microsoft Visual Studio\2017\Community\Common7\IDE\VC\VCTargets\Microsoft.CppCommon.targets(138,5): error MSB3073: "C:\Program Files\CMake\bin\cmake.exe" -E copy_directory C:/GitHub/hifi/tools/jsdoc/out C:/GitHub/hifi/build/interface/Release/jsdoc
89>C:\Program Files (x86)\Microsoft Visual Studio\2017\Community\Common7\IDE\VC\VCTargets\Microsoft.CppCommon.targets(138,5): error MSB3073: if %errorlevel% neq 0 goto :cmEnd
89>C:\Program Files (x86)\Microsoft Visual Studio\2017\Community\Common7\IDE\VC\VCTargets\Microsoft.CppCommon.targets(138,5): error MSB3073: :cmEnd
89>C:\Program Files (x86)\Microsoft Visual Studio\2017\Community\Common7\IDE\VC\VCTargets\Microsoft.CppCommon.targets(138,5): error MSB3073: endlocal & call :cmErrorLevel %errorlevel% & goto :cmDone
89>C:\Program Files (x86)\Microsoft Visual Studio\2017\Community\Common7\IDE\VC\VCTargets\Microsoft.CppCommon.targets(138,5): error MSB3073: :cmErrorLevel
89>C:\Program Files (x86)\Microsoft Visual Studio\2017\Community\Common7\IDE\VC\VCTargets\Microsoft.CppCommon.targets(138,5): error MSB3073: exit /b %1
89>C:\Program Files (x86)\Microsoft Visual Studio\2017\Community\Common7\IDE\VC\VCTargets\Microsoft.CppCommon.targets(138,5): error MSB3073: :cmDone
89>C:\Program Files (x86)\Microsoft Visual Studio\2017\Community\Common7\IDE\VC\VCTargets\Microsoft.CppCommon.targets(138,5): error MSB3073: if %errorlevel% neq 0 goto :VCEnd
89>C:\Program Files (x86)\Microsoft Visual Studio\2017\Community\Common7\IDE\VC\VCTargets\Microsoft.CppCommon.targets(138,5): error MSB3073: setlocal
89>C:\Program Files (x86)\Microsoft Visual Studio\2017\Community\Common7\IDE\VC\VCTargets\Microsoft.CppCommon.targets(138,5): error MSB3073: "C:\Program Files\CMake\bin\cmake.exe" -DBUNDLE_EXECUTABLE="C:/GitHub/hifi/build/interface/Release/interface.exe" -DBUNDLE_PLUGIN_DIR="C:/GitHub/hifi/build/interface/Release/plugins" -P C:/GitHub/hifi/build/interface/FixupBundlePostBuild.cmake
89>C:\Program Files (x86)\Microsoft Visual Studio\2017\Community\Common7\IDE\VC\VCTargets\Microsoft.CppCommon.targets(138,5): error MSB3073: if %errorlevel% neq 0 goto :cmEnd
89>C:\Program Files (x86)\Microsoft Visual Studio\2017\Community\Common7\IDE\VC\VCTargets\Microsoft.CppCommon.targets(138,5): error MSB3073: :cmEnd
89>C:\Program Files (x86)\Microsoft Visual Studio\2017\Community\Common7\IDE\VC\VCTargets\Microsoft.CppCommon.targets(138,5): error MSB3073: endlocal & call :cmErrorLevel %errorlevel% & goto :cmDone
89>C:\Program Files (x86)\Microsoft Visual Studio\2017\Community\Common7\IDE\VC\VCTargets\Microsoft.CppCommon.targets(138,5): error MSB3073: :cmErrorLevel
89>C:\Program Files (x86)\Microsoft Visual Studio\2017\Community\Common7\IDE\VC\VCTargets\Microsoft.CppCommon.targets(138,5): error MSB3073: exit /b %1
89>C:\Program Files (x86)\Microsoft Visual Studio\2017\Community\Common7\IDE\VC\VCTargets\Microsoft.CppCommon.targets(138,5): error MSB3073: :cmDone
89>C:\Program Files (x86)\Microsoft Visual Studio\2017\Community\Common7\IDE\VC\VCTargets\Microsoft.CppCommon.targets(138,5): error MSB3073: if %errorlevel% neq 0 goto :VCEnd
89>C:\Program Files (x86)\Microsoft Visual Studio\2017\Community\Common7\IDE\VC\VCTargets\Microsoft.CppCommon.targets(138,5): error MSB3073: setlocal
89>C:\Program Files (x86)\Microsoft Visual Studio\2017\Community\Common7\IDE\VC\VCTargets\Microsoft.CppCommon.targets(138,5): error MSB3073: CMD /C SET PATH=%PATH%;C:/Qt/5.10.1/msvc2017_64/bin && C:/Qt/5.10.1/msvc2017_64/bin/windeployqt.exe --qmldir "C:/GitHub/hifi/interface/resources/qml" --release --no-compiler-runtime --no-opengl-sw --no-angle -no-system-d3d-compiler "C:/GitHub/hifi/build/interface/Release/interface.exe"
89>C:\Program Files (x86)\Microsoft Visual Studio\2017\Community\Common7\IDE\VC\VCTargets\Microsoft.CppCommon.targets(138,5): error MSB3073: if %errorlevel% neq 0 goto :cmEnd
89>C:\Program Files (x86)\Microsoft Visual Studio\2017\Community\Common7\IDE\VC\VCTargets\Microsoft.CppCommon.targets(138,5): error MSB3073: :cmEnd
89>C:\Program Files (x86)\Microsoft Visual Studio\2017\Community\Common7\IDE\VC\VCTargets\Microsoft.CppCommon.targets(138,5): error MSB3073: endlocal & call :cmErrorLevel %errorlevel% & goto :cmDone
89>C:\Program Files (x86)\Microsoft Visual Studio\2017\Community\Common7\IDE\VC\VCTargets\Microsoft.CppCommon.targets(138,5): error MSB3073: :cmErrorLevel
89>C:\Program Files (x86)\Microsoft Visual Studio\2017\Community\Common7\IDE\VC\VCTargets\Microsoft.CppCommon.targets(138,5): error MSB3073: exit /b %1
89>C:\Program Files (x86)\Microsoft Visual Studio\2017\Community\Common7\IDE\VC\VCTargets\Microsoft.CppCommon.targets(138,5): error MSB3073: :cmDone
89>C:\Program Files (x86)\Microsoft Visual Studio\2017\Community\Common7\IDE\VC\VCTargets\Microsoft.CppCommon.targets(138,5): error MSB3073: if %errorlevel% neq 0 goto :VCEnd
89>C:\Program Files (x86)\Microsoft Visual Studio\2017\Community\Common7\IDE\VC\VCTargets\Microsoft.CppCommon.targets(138,5): error MSB3073: setlocal
89>C:\Program Files (x86)\Microsoft Visual Studio\2017\Community\Common7\IDE\VC\VCTargets\Microsoft.CppCommon.targets(138,5): error MSB3073: "C:\Program Files\CMake\bin\cmake.exe" -E make_directory C:/GitHub/hifi/build/interface/Release/audioWin7/audio
89>C:\Program Files (x86)\Microsoft Visual Studio\2017\Community\Common7\IDE\VC\VCTargets\Microsoft.CppCommon.targets(138,5): error MSB3073: if %errorlevel% neq 0 goto :cmEnd
89>C:\Program Files (x86)\Microsoft Visual Studio\2017\Community\Common7\IDE\VC\VCTargets\Microsoft.CppCommon.targets(138,5): error MSB3073: "C:\Program Files\CMake\bin\cmake.exe" -E make_directory C:/GitHub/hifi/build/interface/Release/audioWin8/audio
89>C:\Program Files (x86)\Microsoft Visual Studio\2017\Community\Common7\IDE\VC\VCTargets\Microsoft.CppCommon.targets(138,5): error MSB3073: if %errorlevel% neq 0 goto :cmEnd
89>C:\Program Files (x86)\Microsoft Visual Studio\2017\Community\Common7\IDE\VC\VCTargets\Microsoft.CppCommon.targets(138,5): error MSB3073: if exist C:/GitHub/hifi/build/interface/Release/audio/qtaudio_windows.dll ( "C:/Program Files/CMake/bin/cmake.exe" -E copy C:/GitHub/hifi/build/interface/Release/audio/qtaudio_windows.dll C:/GitHub/hifi/build/interface/Release/audioWin7/audio )
89>C:\Program Files (x86)\Microsoft Visual Studio\2017\Community\Common7\IDE\VC\VCTargets\Microsoft.CppCommon.targets(138,5): error MSB3073: if %errorlevel% neq 0 goto :cmEnd
89>C:\Program Files (x86)\Microsoft Visual Studio\2017\Community\Common7\IDE\VC\VCTargets\Microsoft.CppCommon.targets(138,5): error MSB3073: if exist C:/GitHub/hifi/build/interface/Release/audio/qtaudio_windows.dll ( "C:/Program Files/CMake/bin/cmake.exe" -E copy C:/GitHub/hifi/build/ext/vc14/wasapi/project/src/wasapi/qtaudio_wasapi.dll C:/GitHub/hifi/build/interface/Release/audioWin8/audio )
89>C:\Program Files (x86)\Microsoft Visual Studio\2017\Community\Common7\IDE\VC\VCTargets\Microsoft.CppCommon.targets(138,5): error MSB3073: if %errorlevel% neq 0 goto :cmEnd
89>C:\Program Files (x86)\Microsoft Visual Studio\2017\Community\Common7\IDE\VC\VCTargets\Microsoft.CppCommon.targets(138,5): error MSB3073: if exist C:/GitHub/hifi/build/interface/Release/audio/qtaudio_windowsd.dll ( "C:/Program Files/CMake/bin/cmake.exe" -E copy C:/GitHub/hifi/build/interface/Release/audio/qtaudio_windowsd.dll C:/GitHub/hifi/build/interface/Release/audioWin7/audio )
89>C:\Program Files (x86)\Microsoft Visual Studio\2017\Community\Common7\IDE\VC\VCTargets\Microsoft.CppCommon.targets(138,5): error MSB3073: if %errorlevel% neq 0 goto :cmEnd
89>C:\Program Files (x86)\Microsoft Visual Studio\2017\Community\Common7\IDE\VC\VCTargets\Microsoft.CppCommon.targets(138,5): error MSB3073: if exist C:/GitHub/hifi/build/interface/Release/audio/qtaudio_windowsd.dll ( "C:/Program Files/CMake/bin/cmake.exe" -E copy C:/GitHub/hifi/build/ext/vc14/wasapi/project/src/wasapi/qtaudio_wasapid.dll C:/GitHub/hifi/build/interface/Release/audioWin8/audio )
89>C:\Program Files (x86)\Microsoft Visual Studio\2017\Community\Common7\IDE\VC\VCTargets\Microsoft.CppCommon.targets(138,5): error MSB3073: if %errorlevel% neq 0 goto :cmEnd
89>C:\Program Files (x86)\Microsoft Visual Studio\2017\Community\Common7\IDE\VC\VCTargets\Microsoft.CppCommon.targets(138,5): error MSB3073: "C:\Program Files\CMake\bin\cmake.exe" -E remove_directory C:/GitHub/hifi/build/interface/Release/audio
89>C:\Program Files (x86)\Microsoft Visual Studio\2017\Community\Common7\IDE\VC\VCTargets\Microsoft.CppCommon.targets(138,5): error MSB3073: if %errorlevel% neq 0 goto :cmEnd
89>C:\Program Files (x86)\Microsoft Visual Studio\2017\Community\Common7\IDE\VC\VCTargets\Microsoft.CppCommon.targets(138,5): error MSB3073: :cmEnd
89>C:\Program Files (x86)\Microsoft Visual Studio\2017\Community\Common7\IDE\VC\VCTargets\Microsoft.CppCommon.targets(138,5): error MSB3073: endlocal & call :cmErrorLevel %errorlevel% & goto :cmDone
89>C:\Program Files (x86)\Microsoft Visual Studio\2017\Community\Common7\IDE\VC\VCTargets\Microsoft.CppCommon.targets(138,5): error MSB3073: :cmErrorLevel
89>C:\Program Files (x86)\Microsoft Visual Studio\2017\Community\Common7\IDE\VC\VCTargets\Microsoft.CppCommon.targets(138,5): error MSB3073: exit /b %1
89>C:\Program Files (x86)\Microsoft Visual Studio\2017\Community\Common7\IDE\VC\VCTargets\Microsoft.CppCommon.targets(138,5): error MSB3073: :cmDone
89>C:\Program Files (x86)\Microsoft Visual Studio\2017\Community\Common7\IDE\VC\VCTargets\Microsoft.CppCommon.targets(138,5): error MSB3073: if %errorlevel% neq 0 goto :VCEnd
89>C:\Program Files (x86)\Microsoft Visual Studio\2017\Community\Common7\IDE\VC\VCTargets\Microsoft.CppCommon.targets(138,5): error MSB3073: :VCEnd" exited with code 1.
89>Done building project "interface.vcxproj" -- FAILED.
164>------ Build started: Project: ALL_BUILD, Configuration: Release x64 ------
164>Building Custom Rule C:/GitHub/hifi/CMakeLists.txt
164>CMake does not need to re-run because C:/GitHub/hifi/build/CMakeFiles/generate.stamp is up-to-date.
165>------ Skipped Build: Project: PACKAGE, Configuration: Release x64 ------
165>Project not selected to build for this solution configuration
166>------ Skipped Build: Project: INSTALL, Configuration: Release x64 ------
166>Project not selected to build for this solution configuration
========== Build: 102 succeeded, 1 failed, 0 up-to-date, 63 skipped ==========
Comments
0 B
|👍
/👎