[100%] Building CXX object src/CMakeFiles/zdoom.dir/autozend.o
Linking CXX executable ../zandronum
ld: warning: object file compiled with -mlong-branch which is no longer needed. To remove this warning, recompile without -mlong-branch: /opt/local/lib/apple-gcc42/gcc/powerpc-apple-darwin8/4.2.1/crt3.o
Undefined symbols:
"_OSAtomicCompareAndSwapPtrBarrier", referenced from:
_sqlite3MemInit in libsqlite3.a(sqlite3.o)
ld: symbol(s) not found
collect2: ld returned 1 exit status
src/CMakeFiles/zdoom.dir/build.make:9519: ошибка выполнения рецепта для цели «zandronum»
make[2]: *** [zandronum] Ошибка 1
CMakeFiles/Makefile2:873: ошибка выполнения рецепта для цели «src/CMakeFiles/zdoom.dir/all»
make[1]: *** [src/CMakeFiles/zdoom.dir/all] Ошибка 2
Makefile:75: ошибка выполнения рецепта для цели «all»
make: *** [all] Ошибка 2
Comments