digitalcustodians icon

Dollarydoos CentOS 6.7 Make -k -l errors

digitalcustodians | PRO | 10/23/17 08:01:37 AM UTC | 0 ⭐ | 7805 👁️ | Never ⏰ | []
Make |

127.96 KB

|

None

|

0 👍

/

0 👎

[ 10%] Building CXX object src/CMakeFiles/Common.dir/Common/ConsoleTools.cpp.o
cc1plus: error: invalid option argument ‘-Ofast’
cc1plus: error: -Werror=unused-result: No option -Wunused-result
cc1plus: error: -Werror=maybe-uninitialized: No option -Wmaybe-uninitialized
cc1plus: error: unrecognized command line option "-std=c++11"
make[3]: *** [src/CMakeFiles/Common.dir/Common/ConsoleTools.cpp.o] Error 1
[ 11%] Building CXX object src/CMakeFiles/Common.dir/Common/StringView.cpp.o
cc1plus: error: invalid option argument ‘-Ofast’
cc1plus: error: -Werror=unused-result: No option -Wunused-result
cc1plus: error: -Werror=maybe-uninitialized: No option -Wmaybe-uninitialized
cc1plus: error: unrecognized command line option "-std=c++11"
make[3]: *** [src/CMakeFiles/Common.dir/Common/StringView.cpp.o] Error 1
[ 11%] Building CXX object src/CMakeFiles/Common.dir/Common/StdOutputStream.cpp.o
cc1plus: error: invalid option argument ‘-Ofast’
cc1plus: error: -Werror=unused-result: No option -Wunused-result
cc1plus: error: -Werror=maybe-uninitialized: No option -Wmaybe-uninitialized
cc1plus: error: unrecognized command line option "-std=c++11"
make[3]: *** [src/CMakeFiles/Common.dir/Common/StdOutputStream.cpp.o] Error 1
[ 11%] Building CXX object src/CMakeFiles/Common.dir/Common/CommandLine.cpp.o
cc1plus: error: invalid option argument ‘-Ofast’
cc1plus: error: -Werror=unused-result: No option -Wunused-result
cc1plus: error: -Werror=maybe-uninitialized: No option -Wmaybe-uninitialized
cc1plus: error: unrecognized command line option "-std=c++11"
make[3]: *** [src/CMakeFiles/Common.dir/Common/CommandLine.cpp.o] Error 1
make[3]: Target `src/CMakeFiles/Common.dir/build' not remade because of errors.
make[3]: Leaving directory `/var/git/dollarydoos/build/release'
make[2]: *** [src/CMakeFiles/Common.dir/all] Error 2
make[3]: Entering directory `/var/git/dollarydoos/build/release'
Scanning dependencies of target System
make[3]: Leaving directory `/var/git/dollarydoos/build/release'
make[3]: Entering directory `/var/git/dollarydoos/build/release'
[ 12%] Building CXX object src/CMakeFiles/System.dir/System/Ipv4Address.cpp.o
cc1plus: error: invalid option argument ‘-Ofast’
cc1plus: error: -Werror=unused-result: No option -Wunused-result
cc1plus: error: -Werror=maybe-uninitialized: No option -Wmaybe-uninitialized
cc1plus: error: unrecognized command line option "-std=c++11"
make[3]: *** [src/CMakeFiles/System.dir/System/Ipv4Address.cpp.o] Error 1
[ 12%] Building CXX object src/CMakeFiles/System.dir/System/Event.cpp.o
cc1plus: error: invalid option argument ‘-Ofast’
cc1plus: error: -Werror=unused-result: No option -Wunused-result
cc1plus: error: -Werror=maybe-uninitialized: No option -Wmaybe-uninitialized
cc1plus: error: unrecognized command line option "-std=c++11"
make[3]: *** [src/CMakeFiles/System.dir/System/Event.cpp.o] Error 1
[ 12%] Building CXX object src/CMakeFiles/System.dir/System/TcpStream.cpp.o
cc1plus: error: invalid option argument ‘-Ofast’
cc1plus: error: -Werror=unused-result: No option -Wunused-result
cc1plus: error: -Werror=maybe-uninitialized: No option -Wmaybe-uninitialized
cc1plus: error: unrecognized command line option "-std=c++11"
make[3]: *** [src/CMakeFiles/System.dir/System/TcpStream.cpp.o] Error 1
[ 12%] Building CXX object src/CMakeFiles/System.dir/System/EventLock.cpp.o
cc1plus: error: invalid option argument ‘-Ofast’
cc1plus: error: -Werror=unused-result: No option -Wunused-result
cc1plus: error: -Werror=maybe-uninitialized: No option -Wmaybe-uninitialized
cc1plus: error: unrecognized command line option "-std=c++11"
make[3]: *** [src/CMakeFiles/System.dir/System/EventLock.cpp.o] Error 1
[ 13%] Building CXX object src/CMakeFiles/System.dir/System/RemoteEventLock.cpp.o
cc1plus: error: invalid option argument ‘-Ofast’
cc1plus: error: -Werror=unused-result: No option -Wunused-result
cc1plus: error: -Werror=maybe-uninitialized: No option -Wmaybe-uninitialized
cc1plus: error: unrecognized command line option "-std=c++11"
make[3]: *** [src/CMakeFiles/System.dir/System/RemoteEventLock.cpp.o] Error 1
[ 13%] Building CXX object src/CMakeFiles/System.dir/System/ContextGroupTimeout.cpp.o
cc1plus: error: invalid option argument ‘-Ofast’
cc1plus: error: -Werror=unused-result: No option -Wunused-result
cc1plus: error: -Werror=maybe-uninitialized: No option -Wmaybe-uninitialized
cc1plus: error: unrecognized command line option "-std=c++11"
make[3]: *** [src/CMakeFiles/System.dir/System/ContextGroupTimeout.cpp.o] Error 1
[ 13%] Building CXX object src/CMakeFiles/System.dir/System/InterruptedException.cpp.o
cc1plus: error: invalid option argument ‘-Ofast’
cc1plus: error: -Werror=unused-result: No option -Wunused-result
cc1plus: error: -Werror=maybe-uninitialized: No option -Wmaybe-uninitialized
cc1plus: error: unrecognized command line option "-std=c++11"
make[3]: *** [src/CMakeFiles/System.dir/System/InterruptedException.cpp.o] Error 1
[ 13%] Building CXX object src/CMakeFiles/System.dir/System/ContextGroup.cpp.o
cc1plus: error: invalid option argument ‘-Ofast’
cc1plus: error: -Werror=unused-result: No option -Wunused-result
cc1plus: error: -Werror=maybe-uninitialized: No option -Wmaybe-uninitialized
cc1plus: error: unrecognized command line option "-std=c++11"
make[3]: *** [src/CMakeFiles/System.dir/System/ContextGroup.cpp.o] Error 1
[ 14%] Building CXX object src/CMakeFiles/System.dir/Platform/Linux/System/ErrorMessage.c                                                       pp.o
cc1plus: error: invalid option argument ‘-Ofast’
cc1plus: error: -Werror=unused-result: No option -Wunused-result
cc1plus: error: -Werror=maybe-uninitialized: No option -Wmaybe-uninitialized
cc1plus: error: unrecognized command line option "-std=c++11"
make[3]: *** [src/CMakeFiles/System.dir/Platform/Linux/System/ErrorMessage.cpp.o] Error 1
[ 14%] Building CXX object src/CMakeFiles/System.dir/Platform/Linux/System/Timer.cpp.o
cc1plus: error: invalid option argument ‘-Ofast’
cc1plus: error: -Werror=unused-result: No option -Wunused-result
cc1plus: error: -Werror=maybe-uninitialized: No option -Wmaybe-uninitialized
cc1plus: error: unrecognized command line option "-std=c++11"
make[3]: *** [src/CMakeFiles/System.dir/Platform/Linux/System/Timer.cpp.o] Error 1
[ 14%] Building CXX object src/CMakeFiles/System.dir/Platform/Linux/System/TcpListener.cp                                                       p.o
cc1plus: error: invalid option argument ‘-Ofast’
cc1plus: error: -Werror=unused-result: No option -Wunused-result
cc1plus: error: -Werror=maybe-uninitialized: No option -Wmaybe-uninitialized
cc1plus: error: unrecognized command line option "-std=c++11"
make[3]: *** [src/CMakeFiles/System.dir/Platform/Linux/System/TcpListener.cpp.o] Error 1
[ 15%] Building CXX object src/CMakeFiles/System.dir/Platform/Linux/System/TcpConnection.                                                       cpp.o
cc1plus: error: invalid option argument ‘-Ofast’
cc1plus: error: -Werror=unused-result: No option -Wunused-result
cc1plus: error: -Werror=maybe-uninitialized: No option -Wmaybe-uninitialized
cc1plus: error: unrecognized command line option "-std=c++11"
make[3]: *** [src/CMakeFiles/System.dir/Platform/Linux/System/TcpConnection.cpp.o] Error                                                        1
[ 15%] Building CXX object src/CMakeFiles/System.dir/Platform/Linux/System/Ipv4Resolver.c                                                       pp.o
cc1plus: error: invalid option argument ‘-Ofast’
cc1plus: error: -Werror=unused-result: No option -Wunused-result
cc1plus: error: -Werror=maybe-uninitialized: No option -Wmaybe-uninitialized
cc1plus: error: unrecognized command line option "-std=c++11"
make[3]: *** [src/CMakeFiles/System.dir/Platform/Linux/System/Ipv4Resolver.cpp.o] Error 1
[ 15%] Building CXX object src/CMakeFiles/System.dir/Platform/Linux/System/TcpConnector.c                                                       pp.o
cc1plus: error: invalid option argument ‘-Ofast’
cc1plus: error: -Werror=unused-result: No option -Wunused-result
cc1plus: error: -Werror=maybe-uninitialized: No option -Wmaybe-uninitialized
cc1plus: error: unrecognized command line option "-std=c++11"
make[3]: *** [src/CMakeFiles/System.dir/Platform/Linux/System/TcpConnector.cpp.o] Error 1
[ 15%] Building CXX object src/CMakeFiles/System.dir/Platform/Linux/System/Dispatcher.cpp                                                       .o
cc1plus: error: invalid option argument ‘-Ofast’
cc1plus: error: -Werror=unused-result: No option -Wunused-result
cc1plus: error: -Werror=maybe-uninitialized: No option -Wmaybe-uninitialized
cc1plus: error: unrecognized command line option "-std=c++11"
make[3]: *** [src/CMakeFiles/System.dir/Platform/Linux/System/Dispatcher.cpp.o] Error 1
[ 16%] Building CXX object src/CMakeFiles/System.dir/Platform/Posix/System/MemoryMappedFi                                                       le.cpp.o
cc1plus: error: invalid option argument ‘-Ofast’
cc1plus: error: -Werror=unused-result: No option -Wunused-result
cc1plus: error: -Werror=maybe-uninitialized: No option -Wmaybe-uninitialized
cc1plus: error: unrecognized command line option "-std=c++11"
make[3]: *** [src/CMakeFiles/System.dir/Platform/Posix/System/MemoryMappedFile.cpp.o] Err                                                       or 1
make[3]: Target `src/CMakeFiles/System.dir/build' not remade because of errors.
make[3]: Leaving directory `/var/git/dollarydoos/build/release'
make[2]: *** [src/CMakeFiles/System.dir/all] Error 2
make[3]: Entering directory `/var/git/dollarydoos/build/release'
Scanning dependencies of target Crypto
make[3]: Leaving directory `/var/git/dollarydoos/build/release'
make[3]: Entering directory `/var/git/dollarydoos/build/release'
[ 16%] Building C object src/CMakeFiles/Crypto.dir/crypto/chacha8.c.o
cc1: error: invalid option argument ‘-Ofast’
cc1: error: -Werror=unused-result: No option -Wunused-result
cc1: error: -Werror=maybe-uninitialized: No option -Wmaybe-uninitialized
cc1: error: unrecognized command line option "-std=c11"
make[3]: *** [src/CMakeFiles/Crypto.dir/crypto/chacha8.c.o] Error 1
[ 16%] Building C object src/CMakeFiles/Crypto.dir/crypto/hash-extra-jh.c.o
cc1: error: invalid option argument ‘-Ofast’
cc1: error: -Werror=unused-result: No option -Wunused-result
cc1: error: -Werror=maybe-uninitialized: No option -Wmaybe-uninitialized
cc1: error: unrecognized command line option "-std=c11"
make[3]: *** [src/CMakeFiles/Crypto.dir/crypto/hash-extra-jh.c.o] Error 1
[ 16%] Building C object src/CMakeFiles/Crypto.dir/crypto/blake256.c.o
cc1: error: invalid option argument ‘-Ofast’
cc1: error: -Werror=unused-result: No option -Wunused-result
cc1: error: -Werror=maybe-uninitialized: No option -Wmaybe-uninitialized
cc1: error: unrecognized command line option "-std=c11"
make[3]: *** [src/CMakeFiles/Crypto.dir/crypto/blake256.c.o] Error 1
[ 17%] Building C object src/CMakeFiles/Crypto.dir/crypto/jh.c.o
cc1: error: invalid option argument ‘-Ofast’
cc1: error: -Werror=unused-result: No option -Wunused-result
cc1: error: -Werror=maybe-uninitialized: No option -Wmaybe-uninitialized
cc1: error: unrecognized command line option "-std=c11"
make[3]: *** [src/CMakeFiles/Crypto.dir/crypto/jh.c.o] Error 1
[ 17%] Building C object src/CMakeFiles/Crypto.dir/crypto/hash.c.o
cc1: error: invalid option argument ‘-Ofast’
cc1: error: -Werror=unused-result: No option -Wunused-result
cc1: error: -Werror=maybe-uninitialized: No option -Wmaybe-uninitialized
cc1: error: unrecognized command line option "-std=c11"
make[3]: *** [src/CMakeFiles/Crypto.dir/crypto/hash.c.o] Error 1
[ 17%] Building C object src/CMakeFiles/Crypto.dir/crypto/tree-hash.c.o
cc1: error: invalid option argument ‘-Ofast’
cc1: error: -Werror=unused-result: No option -Wunused-result
cc1: error: -Werror=maybe-uninitialized: No option -Wmaybe-uninitialized
cc1: error: unrecognized command line option "-std=c11"
make[3]: *** [src/CMakeFiles/Crypto.dir/crypto/tree-hash.c.o] Error 1
[ 17%] Building C object src/CMakeFiles/Crypto.dir/crypto/skein.c.o
cc1: error: invalid option argument ‘-Ofast’
cc1: error: -Werror=unused-result: No option -Wunused-result
cc1: error: -Werror=maybe-uninitialized: No option -Wmaybe-uninitialized
cc1: error: unrecognized command line option "-std=c11"
make[3]: *** [src/CMakeFiles/Crypto.dir/crypto/skein.c.o] Error 1
[ 18%] Building C object src/CMakeFiles/Crypto.dir/crypto/crypto-ops.c.o
cc1: error: invalid option argument ‘-Ofast’
cc1: error: -Werror=unused-result: No option -Wunused-result
cc1: error: -Werror=maybe-uninitialized: No option -Wmaybe-uninitialized
cc1: error: unrecognized command line option "-std=c11"
make[3]: *** [src/CMakeFiles/Crypto.dir/crypto/crypto-ops.c.o] Error 1
[ 18%] Building C object src/CMakeFiles/Crypto.dir/crypto/slow-hash.c.o
cc1: error: invalid option argument ‘-Ofast’
cc1: error: -Werror=unused-result: No option -Wunused-result
cc1: error: -Werror=maybe-uninitialized: No option -Wmaybe-uninitialized
cc1: error: unrecognized command line option "-std=c11"
make[3]: *** [src/CMakeFiles/Crypto.dir/crypto/slow-hash.c.o] Error 1
[ 18%] Building CXX object src/CMakeFiles/Crypto.dir/crypto/slow-hash.cpp.o
cc1plus: error: invalid option argument ‘-Ofast’
cc1plus: error: -Werror=unused-result: No option -Wunused-result
cc1plus: error: -Werror=maybe-uninitialized: No option -Wmaybe-uninitialized
cc1plus: error: unrecognized command line option "-std=c++11"
make[3]: *** [src/CMakeFiles/Crypto.dir/crypto/slow-hash.cpp.o] Error 1
[ 19%] Building C object src/CMakeFiles/Crypto.dir/crypto/random.c.o
cc1: error: invalid option argument ‘-Ofast’
cc1: error: -Werror=unused-result: No option -Wunused-result
cc1: error: -Werror=maybe-uninitialized: No option -Wmaybe-uninitialized
cc1: error: unrecognized command line option "-std=c11"
make[3]: *** [src/CMakeFiles/Crypto.dir/crypto/random.c.o] Error 1
[ 19%] Building C object src/CMakeFiles/Crypto.dir/crypto/groestl.c.o
cc1: error: invalid option argument ‘-Ofast’
cc1: error: -Werror=unused-result: No option -Wunused-result
cc1: error: -Werror=maybe-uninitialized: No option -Wmaybe-uninitialized
cc1: error: unrecognized command line option "-std=c11"
make[3]: *** [src/CMakeFiles/Crypto.dir/crypto/groestl.c.o] Error 1
[ 19%] Building C object src/CMakeFiles/Crypto.dir/crypto/hash-extra-blake.c.o
cc1: error: invalid option argument ‘-Ofast’
cc1: error: -Werror=unused-result: No option -Wunused-result
cc1: error: -Werror=maybe-uninitialized: No option -Wmaybe-uninitialized
cc1: error: unrecognized command line option "-std=c11"
make[3]: *** [src/CMakeFiles/Crypto.dir/crypto/hash-extra-blake.c.o] Error 1
[ 19%] Building C object src/CMakeFiles/Crypto.dir/crypto/crypto-ops-data.c.o
cc1: error: invalid option argument ‘-Ofast’
cc1: error: -Werror=unused-result: No option -Wunused-result
cc1: error: -Werror=maybe-uninitialized: No option -Wmaybe-uninitialized
cc1: error: unrecognized command line option "-std=c11"
make[3]: *** [src/CMakeFiles/Crypto.dir/crypto/crypto-ops-data.c.o] Error 1
[ 20%] Building CXX object src/CMakeFiles/Crypto.dir/crypto/crypto.cpp.o
cc1plus: error: invalid option argument ‘-Ofast’
cc1plus: error: -Werror=unused-result: No option -Wunused-result
cc1plus: error: -Werror=maybe-uninitialized: No option -Wmaybe-uninitialized
cc1plus: error: unrecognized command line option "-std=c++11"
make[3]: *** [src/CMakeFiles/Crypto.dir/crypto/crypto.cpp.o] Error 1
[ 20%] Building C object src/CMakeFiles/Crypto.dir/crypto/hash-extra-groestl.c.o
cc1: error: invalid option argument ‘-Ofast’
cc1: error: -Werror=unused-result: No option -Wunused-result
cc1: error: -Werror=maybe-uninitialized: No option -Wmaybe-uninitialized
cc1: error: unrecognized command line option "-std=c11"
make[3]: *** [src/CMakeFiles/Crypto.dir/crypto/hash-extra-groestl.c.o] Error 1
[ 20%] Building C object src/CMakeFiles/Crypto.dir/crypto/oaes_lib.c.o
cc1: error: invalid option argument ‘-Ofast’
cc1: error: -Werror=unused-result: No option -Wunused-result
cc1: error: -Werror=maybe-uninitialized: No option -Wmaybe-uninitialized
cc1: error: unrecognized command line option "-std=c11"
make[3]: *** [src/CMakeFiles/Crypto.dir/crypto/oaes_lib.c.o] Error 1
[ 20%] Building C object src/CMakeFiles/Crypto.dir/crypto/keccak.c.o
cc1: error: invalid option argument ‘-Ofast’
cc1: error: -Werror=unused-result: No option -Wunused-result
cc1: error: -Werror=maybe-uninitialized: No option -Wmaybe-uninitialized
cc1: error: unrecognized command line option "-std=c11"
make[3]: *** [src/CMakeFiles/Crypto.dir/crypto/keccak.c.o] Error 1
[ 21%] Building C object src/CMakeFiles/Crypto.dir/crypto/hash-extra-skein.c.o
cc1: error: invalid option argument ‘-Ofast’
cc1: error: -Werror=unused-result: No option -Wunused-result
cc1: error: -Werror=maybe-uninitialized: No option -Wmaybe-uninitialized
cc1: error: unrecognized command line option "-std=c11"
make[3]: *** [src/CMakeFiles/Crypto.dir/crypto/hash-extra-skein.c.o] Error 1
make[3]: Target `src/CMakeFiles/Crypto.dir/build' not remade because of errors.
make[3]: Leaving directory `/var/git/dollarydoos/build/release'
make[2]: *** [src/CMakeFiles/Crypto.dir/all] Error 2
make[3]: Entering directory `/var/git/dollarydoos/build/release'
Scanning dependencies of target Http
make[3]: Leaving directory `/var/git/dollarydoos/build/release'
make[3]: Entering directory `/var/git/dollarydoos/build/release'
[ 21%] Building CXX object src/CMakeFiles/Http.dir/HTTP/HttpResponse.cpp.o
cc1plus: error: invalid option argument ‘-Ofast’
cc1plus: error: -Werror=unused-result: No option -Wunused-result
cc1plus: error: -Werror=maybe-uninitialized: No option -Wmaybe-uninitialized
cc1plus: error: unrecognized command line option "-std=c++11"
make[3]: *** [src/CMakeFiles/Http.dir/HTTP/HttpResponse.cpp.o] Error 1
[ 21%] Building CXX object src/CMakeFiles/Http.dir/HTTP/HttpParser.cpp.o
cc1plus: error: invalid option argument ‘-Ofast’
cc1plus: error: -Werror=unused-result: No option -Wunused-result
cc1plus: error: -Werror=maybe-uninitialized: No option -Wmaybe-uninitialized
cc1plus: error: unrecognized command line option "-std=c++11"
make[3]: *** [src/CMakeFiles/Http.dir/HTTP/HttpParser.cpp.o] Error 1
[ 22%] Building CXX object src/CMakeFiles/Http.dir/HTTP/HttpRequest.cpp.o
cc1plus: error: invalid option argument ‘-Ofast’
cc1plus: error: -Werror=unused-result: No option -Wunused-result
cc1plus: error: -Werror=maybe-uninitialized: No option -Wmaybe-uninitialized
cc1plus: error: unrecognized command line option "-std=c++11"
make[3]: *** [src/CMakeFiles/Http.dir/HTTP/HttpRequest.cpp.o] Error 1
[ 22%] Building CXX object src/CMakeFiles/Http.dir/HTTP/HttpParserErrorCodes.cpp.o
cc1plus: error: invalid option argument ‘-Ofast’
cc1plus: error: -Werror=unused-result: No option -Wunused-result
cc1plus: error: -Werror=maybe-uninitialized: No option -Wmaybe-uninitialized
cc1plus: error: unrecognized command line option "-std=c++11"
make[3]: *** [src/CMakeFiles/Http.dir/HTTP/HttpParserErrorCodes.cpp.o] Error 1
make[3]: Target `src/CMakeFiles/Http.dir/build' not remade because of errors.
make[3]: Leaving directory `/var/git/dollarydoos/build/release'
make[2]: *** [src/CMakeFiles/Http.dir/all] Error 2
make[3]: Entering directory `/var/git/dollarydoos/build/release'
Scanning dependencies of target Serialization
make[3]: Leaving directory `/var/git/dollarydoos/build/release'
make[3]: Entering directory `/var/git/dollarydoos/build/release'
[ 22%] Building CXX object src/CMakeFiles/Serialization.dir/Serialization/BlockchainExplo                                                       rerDataSerialization.cpp.o
cc1plus: error: invalid option argument ‘-Ofast’
cc1plus: error: -Werror=unused-result: No option -Wunused-result
cc1plus: error: -Werror=maybe-uninitialized: No option -Wmaybe-uninitialized
cc1plus: error: unrecognized command line option "-std=c++11"
make[3]: *** [src/CMakeFiles/Serialization.dir/Serialization/BlockchainExplorerDataSerial                                                       ization.cpp.o] Error 1
[ 23%] Building CXX object src/CMakeFiles/Serialization.dir/Serialization/JsonInputStream                                                       Serializer.cpp.o
cc1plus: error: invalid option argument ‘-Ofast’
cc1plus: error: -Werror=unused-result: No option -Wunused-result
cc1plus: error: -Werror=maybe-uninitialized: No option -Wmaybe-uninitialized
cc1plus: error: unrecognized command line option "-std=c++11"
make[3]: *** [src/CMakeFiles/Serialization.dir/Serialization/JsonInputStreamSerializer.cp                                                       p.o] Error 1
[ 23%] Building CXX object src/CMakeFiles/Serialization.dir/Serialization/MemoryStream.cp                                                       p.o
cc1plus: error: invalid option argument ‘-Ofast’
cc1plus: error: -Werror=unused-result: No option -Wunused-result
cc1plus: error: -Werror=maybe-uninitialized: No option -Wmaybe-uninitialized
cc1plus: error: unrecognized command line option "-std=c++11"
make[3]: *** [src/CMakeFiles/Serialization.dir/Serialization/MemoryStream.cpp.o] Error 1
[ 23%] Building CXX object src/CMakeFiles/Serialization.dir/Serialization/BinaryOutputStr                                                       eamSerializer.cpp.o
cc1plus: error: invalid option argument ‘-Ofast’
cc1plus: error: -Werror=unused-result: No option -Wunused-result
cc1plus: error: -Werror=maybe-uninitialized: No option -Wmaybe-uninitialized
cc1plus: error: unrecognized command line option "-std=c++11"
make[3]: *** [src/CMakeFiles/Serialization.dir/Serialization/BinaryOutputStreamSerializer                                                       .cpp.o] Error 1
[ 23%] Building CXX object src/CMakeFiles/Serialization.dir/Serialization/SerializationOv                                                       erloads.cpp.o
cc1plus: error: invalid option argument ‘-Ofast’
cc1plus: error: -Werror=unused-result: No option -Wunused-result
cc1plus: error: -Werror=maybe-uninitialized: No option -Wmaybe-uninitialized
cc1plus: error: unrecognized command line option "-std=c++11"
make[3]: *** [src/CMakeFiles/Serialization.dir/Serialization/SerializationOverloads.cpp.o                                                       ] Error 1
[ 24%] Building CXX object src/CMakeFiles/Serialization.dir/Serialization/KVBinaryOutputS                                                       treamSerializer.cpp.o
cc1plus: error: invalid option argument ‘-Ofast’
cc1plus: error: -Werror=unused-result: No option -Wunused-result
cc1plus: error: -Werror=maybe-uninitialized: No option -Wmaybe-uninitialized
cc1plus: error: unrecognized command line option "-std=c++11"
make[3]: *** [src/CMakeFiles/Serialization.dir/Serialization/KVBinaryOutputStreamSerializ                                                       er.cpp.o] Error 1
[ 24%] Building CXX object src/CMakeFiles/Serialization.dir/Serialization/JsonInputValueS                                                       erializer.cpp.o
cc1plus: error: invalid option argument ‘-Ofast’
cc1plus: error: -Werror=unused-result: No option -Wunused-result
cc1plus: error: -Werror=maybe-uninitialized: No option -Wmaybe-uninitialized
cc1plus: error: unrecognized command line option "-std=c++11"
make[3]: *** [src/CMakeFiles/Serialization.dir/Serialization/JsonInputValueSerializer.cpp                                                       .o] Error 1
[ 24%] Building CXX object src/CMakeFiles/Serialization.dir/Serialization/KVBinaryInputSt                                                       reamSerializer.cpp.o
cc1plus: error: invalid option argument ‘-Ofast’
cc1plus: error: -Werror=unused-result: No option -Wunused-result
cc1plus: error: -Werror=maybe-uninitialized: No option -Wmaybe-uninitialized
cc1plus: error: unrecognized command line option "-std=c++11"
make[3]: *** [src/CMakeFiles/Serialization.dir/Serialization/KVBinaryInputStreamSerialize                                                       r.cpp.o] Error 1
[ 25%] Building CXX object src/CMakeFiles/Serialization.dir/Serialization/BinaryInputStre                                                       amSerializer.cpp.o
cc1plus: error: invalid option argument ‘-Ofast’
cc1plus: error: -Werror=unused-result: No option -Wunused-result
cc1plus: error: -Werror=maybe-uninitialized: No option -Wmaybe-uninitialized
cc1plus: error: unrecognized command line option "-std=c++11"
make[3]: *** [src/CMakeFiles/Serialization.dir/Serialization/BinaryInputStreamSerializer.                                                       cpp.o] Error 1
[ 25%] Building CXX object src/CMakeFiles/Serialization.dir/Serialization/JsonOutputStrea                                                       mSerializer.cpp.o
cc1plus: error: invalid option argument ‘-Ofast’
cc1plus: error: -Werror=unused-result: No option -Wunused-result
cc1plus: error: -Werror=maybe-uninitialized: No option -Wmaybe-uninitialized
cc1plus: error: unrecognized command line option "-std=c++11"
make[3]: *** [src/CMakeFiles/Serialization.dir/Serialization/JsonOutputStreamSerializer.c                                                       pp.o] Error 1
make[3]: Target `src/CMakeFiles/Serialization.dir/build' not remade because of errors.
make[3]: Leaving directory `/var/git/dollarydoos/build/release'
make[2]: *** [src/CMakeFiles/Serialization.dir/all] Error 2
make[3]: Entering directory `/var/git/dollarydoos/build/release'
Scanning dependencies of target Logging
make[3]: Leaving directory `/var/git/dollarydoos/build/release'
make[3]: Entering directory `/var/git/dollarydoos/build/release'
[ 25%] Building CXX object src/CMakeFiles/Logging.dir/Logging/CommonLogger.cpp.o
cc1plus: error: invalid option argument ‘-Ofast’
cc1plus: error: -Werror=unused-result: No option -Wunused-result
cc1plus: error: -Werror=maybe-uninitialized: No option -Wmaybe-uninitialized
cc1plus: error: unrecognized command line option "-std=c++11"
make[3]: *** [src/CMakeFiles/Logging.dir/Logging/CommonLogger.cpp.o] Error 1
[ 26%] Building CXX object src/CMakeFiles/Logging.dir/Logging/LoggerManager.cpp.o
cc1plus: error: invalid option argument ‘-Ofast’
cc1plus: error: -Werror=unused-result: No option -Wunused-result
cc1plus: error: -Werror=maybe-uninitialized: No option -Wmaybe-uninitialized
cc1plus: error: unrecognized command line option "-std=c++11"
make[3]: *** [src/CMakeFiles/Logging.dir/Logging/LoggerManager.cpp.o] Error 1
[ 26%] Building CXX object src/CMakeFiles/Logging.dir/Logging/ILogger.cpp.o
cc1plus: error: invalid option argument ‘-Ofast’
cc1plus: error: -Werror=unused-result: No option -Wunused-result
cc1plus: error: -Werror=maybe-uninitialized: No option -Wmaybe-uninitialized
cc1plus: error: unrecognized command line option "-std=c++11"
make[3]: *** [src/CMakeFiles/Logging.dir/Logging/ILogger.cpp.o] Error 1
[ 26%] Building CXX object src/CMakeFiles/Logging.dir/Logging/StreamLogger.cpp.o
cc1plus: error: invalid option argument ‘-Ofast’
cc1plus: error: -Werror=unused-result: No option -Wunused-result
cc1plus: error: -Werror=maybe-uninitialized: No option -Wmaybe-uninitialized
cc1plus: error: unrecognized command line option "-std=c++11"
make[3]: *** [src/CMakeFiles/Logging.dir/Logging/StreamLogger.cpp.o] Error 1
[ 26%] Building CXX object src/CMakeFiles/Logging.dir/Logging/LoggerRef.cpp.o
cc1plus: error: invalid option argument ‘-Ofast’
cc1plus: error: -Werror=unused-result: No option -Wunused-result
cc1plus: error: -Werror=maybe-uninitialized: No option -Wmaybe-uninitialized
cc1plus: error: unrecognized command line option "-std=c++11"
make[3]: *** [src/CMakeFiles/Logging.dir/Logging/LoggerRef.cpp.o] Error 1
[ 27%] Building CXX object src/CMakeFiles/Logging.dir/Logging/LoggerGroup.cpp.o
cc1plus: error: invalid option argument ‘-Ofast’
cc1plus: error: -Werror=unused-result: No option -Wunused-result
cc1plus: error: -Werror=maybe-uninitialized: No option -Wmaybe-uninitialized
cc1plus: error: unrecognized command line option "-std=c++11"
make[3]: *** [src/CMakeFiles/Logging.dir/Logging/LoggerGroup.cpp.o] Error 1
[ 27%] Building CXX object src/CMakeFiles/Logging.dir/Logging/ConsoleLogger.cpp.o
cc1plus: error: invalid option argument ‘-Ofast’
cc1plus: error: -Werror=unused-result: No option -Wunused-result
cc1plus: error: -Werror=maybe-uninitialized: No option -Wmaybe-uninitialized
cc1plus: error: unrecognized command line option "-std=c++11"
make[3]: *** [src/CMakeFiles/Logging.dir/Logging/ConsoleLogger.cpp.o] Error 1
[ 27%] Building CXX object src/CMakeFiles/Logging.dir/Logging/FileLogger.cpp.o
cc1plus: error: invalid option argument ‘-Ofast’
cc1plus: error: -Werror=unused-result: No option -Wunused-result
cc1plus: error: -Werror=maybe-uninitialized: No option -Wmaybe-uninitialized
cc1plus: error: unrecognized command line option "-std=c++11"
make[3]: *** [src/CMakeFiles/Logging.dir/Logging/FileLogger.cpp.o] Error 1
[ 27%] Building CXX object src/CMakeFiles/Logging.dir/Logging/LoggerMessage.cpp.o
cc1plus: error: invalid option argument ‘-Ofast’
cc1plus: error: -Werror=unused-result: No option -Wunused-result
cc1plus: error: -Werror=maybe-uninitialized: No option -Wmaybe-uninitialized
cc1plus: error: unrecognized command line option "-std=c++11"
make[3]: *** [src/CMakeFiles/Logging.dir/Logging/LoggerMessage.cpp.o] Error 1
make[3]: Target `src/CMakeFiles/Logging.dir/build' not remade because of errors.
make[3]: Leaving directory `/var/git/dollarydoos/build/release'
make[2]: *** [src/CMakeFiles/Logging.dir/all] Error 2
make[3]: Entering directory `/var/git/dollarydoos/build/release'
Scanning dependencies of target rocksdb
make[3]: Leaving directory `/var/git/dollarydoos/build/release'
make[3]: Entering directory `/var/git/dollarydoos/build/release'
make[4]: Entering directory `/var/git/dollarydoos/external/rocksdb'
cc1plus: error: unrecognized command line option "-std=c++11"
cc1plus: error: unrecognized command line option "-std=c++11"
cc1plus: error: unrecognized command line option "-std=c++11"
cc1plus: error: unrecognized command line option "-std=c++11"
cc1plus: error: unrecognized command line option "-std=c++11"
cc1plus: error: unrecognized command line option "-std=c++11"
cc1plus: error: unrecognized command line option "-std=c++11"
cc1plus: error: unrecognized command line option "-std=c++11"
cc1plus: error: unrecognized command line option "-std=c++11"
cc1plus: error: unrecognized command line option "-std=c++11"
cc1plus: error: unrecognized command line option "-std=c++11"
cc1plus: error: unrecognized command line option "-std=c++11"
cc1plus: error: unrecognized command line option "-std=c++11"
cc1plus: error: unrecognized command line option "-std=c++11"
cc1plus: error: unrecognized command line option "-std=c++11"
cc1plus: error: unrecognized command line option "-std=c++11"
cc1plus: error: unrecognized command line option "-std=c++11"
cc1plus: error: unrecognized command line option "-std=c++11"
cc1plus: error: unrecognized command line option "-std=c++11"
cc1plus: error: unrecognized command line option "-std=c++11"
cc1plus: error: unrecognized command line option "-std=c++11"
cc1plus: error: unrecognized command line option "-std=c++11"
cc1plus: error: unrecognized command line option "-std=c++11"
cc1plus: error: unrecognized command line option "-std=c++11"
cc1plus: error: unrecognized command line option "-std=c++11"
cc1plus: error: unrecognized command line option "-std=c++11"
cc1plus: error: unrecognized command line option "-std=c++11"
cc1plus: error: unrecognized command line option "-std=c++11"
cc1plus: error: unrecognized command line option "-std=c++11"
cc1plus: error: unrecognized command line option "-std=c++11"
cc1plus: error: unrecognized command line option "-std=c++11"
cc1plus: error: unrecognized command line option "-std=c++11"
cc1plus: error: unrecognized command line option "-std=c++11"
cc1plus: error: unrecognized command line option "-std=c++11"
cc1plus: error: unrecognized command line option "-std=c++11"
cc1plus: error: unrecognized command line option "-std=c++11"
cc1plus: error: unrecognized command line option "-std=c++11"
cc1plus: error: unrecognized command line option "-std=c++11"
cc1plus: error: unrecognized command line option "-std=c++11"
cc1plus: error: unrecognized command line option "-std=c++11"
cc1plus: error: unrecognized command line option "-std=c++11"
cc1plus: error: unrecognized command line option "-std=c++11"
cc1plus: error: unrecognized command line option "-std=c++11"
cc1plus: error: unrecognized command line option "-std=c++11"
cc1plus: error: unrecognized command line option "-std=c++11"
cc1plus: error: unrecognized command line option "-std=c++11"
cc1plus: error: unrecognized command line option "-std=c++11"
cc1plus: error: unrecognized command line option "-std=c++11"
cc1plus: error: unrecognized command line option "-std=c++11"
cc1plus: error: unrecognized command line option "-std=c++11"
cc1plus: error: unrecognized command line option "-std=c++11"
cc1plus: error: unrecognized command line option "-std=c++11"
cc1plus: error: unrecognized command line option "-std=c++11"
cc1plus: error: unrecognized command line option "-std=c++11"
cc1plus: error: unrecognized command line option "-std=c++11"
cc1plus: error: unrecognized command line option "-std=c++11"
cc1plus: error: unrecognized command line option "-std=c++11"
cc1plus: error: unrecognized command line option "-std=c++11"
cc1plus: error: unrecognized command line option "-std=c++11"
cc1plus: error: unrecognized command line option "-std=c++11"
cc1plus: error: unrecognized command line option "-std=c++11"
cc1plus: error: unrecognized command line option "-std=c++11"
cc1plus: error: unrecognized command line option "-std=c++11"
cc1plus: error: unrecognized command line option "-std=c++11"
cc1plus: error: unrecognized command line option "-std=c++11"
cc1plus: error: unrecognized command line option "-std=c++11"
cc1plus: error: unrecognized command line option "-std=c++11"
cc1plus: error: unrecognized command line option "-std=c++11"
cc1plus: error: unrecognized command line option "-std=c++11"
cc1plus: error: unrecognized command line option "-std=c++11"
cc1plus: error: unrecognized command line option "-std=c++11"
cc1plus: error: unrecognized command line option "-std=c++11"
cc1plus: error: unrecognized command line option "-std=c++11"
cc1plus: error: unrecognized command line option "-std=c++11"
cc1plus: error: unrecognized command line option "-std=c++11"
cc1plus: error: unrecognized command line option "-std=c++11"
cc1plus: error: unrecognized command line option "-std=c++11"
cc1plus: error: unrecognized command line option "-std=c++11"
cc1plus: error: unrecognized command line option "-std=c++11"
cc1plus: error: unrecognized command line option "-std=c++11"
cc1plus: error: unrecognized command line option "-std=c++11"
cc1plus: error: unrecognized command line option "-std=c++11"
cc1plus: error: unrecognized command line option "-std=c++11"
cc1plus: error: unrecognized command line option "-std=c++11"
cc1plus: error: unrecognized command line option "-std=c++11"
cc1plus: error: unrecognized command line option "-std=c++11"
cc1plus: error: unrecognized command line option "-std=c++11"
cc1plus: error: unrecognized command line option "-std=c++11"
cc1plus: error: unrecognized command line option "-std=c++11"
cc1plus: error: unrecognized command line option "-std=c++11"
cc1plus: error: unrecognized command line option "-std=c++11"
cc1plus: error: unrecognized command line option "-std=c++11"
cc1plus: error: unrecognized command line option "-std=c++11"
cc1plus: error: unrecognized command line option "-std=c++11"
cc1plus: error: unrecognized command line option "-std=c++11"
cc1plus: error: unrecognized command line option "-std=c++11"
cc1plus: error: unrecognized command line option "-std=c++11"
cc1plus: error: unrecognized command line option "-std=c++11"
cc1plus: error: unrecognized command line option "-std=c++11"
cc1plus: error: unrecognized command line option "-std=c++11"
cc1plus: error: unrecognized command line option "-std=c++11"
cc1plus: error: unrecognized command line option "-std=c++11"
cc1plus: error: unrecognized command line option "-std=c++11"
cc1plus: error: unrecognized command line option "-std=c++11"
cc1plus: error: unrecognized command line option "-std=c++11"
cc1plus: error: unrecognized command line option "-std=c++11"
cc1plus: error: unrecognized command line option "-std=c++11"
cc1plus: error: unrecognized command line option "-std=c++11"
cc1plus: error: unrecognized command line option "-std=c++11"
cc1plus: error: unrecognized command line option "-std=c++11"
cc1plus: error: unrecognized command line option "-std=c++11"
cc1plus: error: unrecognized command line option "-std=c++11"
cc1plus: error: unrecognized command line option "-std=c++11"
cc1plus: error: unrecognized command line option "-std=c++11"
cc1plus: error: unrecognized command line option "-std=c++11"
cc1plus: error: unrecognized command line option "-std=c++11"
cc1plus: error: unrecognized command line option "-std=c++11"
cc1plus: error: unrecognized command line option "-std=c++11"
cc1plus: error: unrecognized command line option "-std=c++11"
cc1plus: error: unrecognized command line option "-std=c++11"
cc1plus: error: unrecognized command line option "-std=c++11"
cc1plus: error: unrecognized command line option "-std=c++11"
cc1plus: error: unrecognized command line option "-std=c++11"
cc1plus: error: unrecognized command line option "-std=c++11"
cc1plus: error: unrecognized command line option "-std=c++11"
cc1plus: error: unrecognized command line option "-std=c++11"
cc1plus: error: unrecognized command line option "-std=c++11"
cc1plus: error: unrecognized command line option "-std=c++11"
cc1plus: error: unrecognized command line option "-std=c++11"
cc1plus: error: unrecognized command line option "-std=c++11"
cc1plus: error: unrecognized command line option "-std=c++11"
cc1plus: error: unrecognized command line option "-std=c++11"
cc1plus: error: unrecognized command line option "-std=c++11"
cc1plus: error: unrecognized command line option "-std=c++11"
cc1plus: error: unrecognized command line option "-std=c++11"
cc1plus: error: unrecognized command line option "-std=c++11"
cc1plus: error: unrecognized command line option "-std=c++11"
cc1plus: error: unrecognized command line option "-std=c++11"
cc1plus: error: unrecognized command line option "-std=c++11"
cc1plus: error: unrecognized command line option "-std=c++11"
cc1plus: error: unrecognized command line option "-std=c++11"
cc1plus: error: unrecognized command line option "-std=c++11"
cc1plus: error: unrecognized command line option "-std=c++11"
cc1plus: error: unrecognized command line option "-std=c++11"
cc1plus: error: unrecognized command line option "-std=c++11"
cc1plus: error: unrecognized command line option "-std=c++11"
cc1plus: error: unrecognized command line option "-std=c++11"
cc1plus: error: unrecognized command line option "-std=c++11"
cc1plus: error: unrecognized command line option "-std=c++11"
cc1plus: error: unrecognized command line option "-std=c++11"
cc1plus: error: unrecognized command line option "-std=c++11"
cc1plus: error: unrecognized command line option "-std=c++11"
cc1plus: error: unrecognized command line option "-std=c++11"
cc1plus: error: unrecognized command line option "-std=c++11"
cc1plus: error: unrecognized command line option "-std=c++11"
cc1plus: error: unrecognized command line option "-std=c++11"
cc1plus: error: unrecognized command line option "-std=c++11"
cc1plus: error: unrecognized command line option "-std=c++11"
cc1plus: error: unrecognized command line option "-std=c++11"
cc1plus: error: unrecognized command line option "-std=c++11"
cc1plus: error: unrecognized command line option "-std=c++11"
cc1plus: error: unrecognized command line option "-std=c++11"
cc1plus: error: unrecognized command line option "-std=c++11"
cc1plus: error: unrecognized command line option "-std=c++11"
cc1plus: error: unrecognized command line option "-std=c++11"
cc1plus: error: unrecognized command line option "-std=c++11"
cc1plus: error: unrecognized command line option "-std=c++11"
cc1plus: error: unrecognized command line option "-std=c++11"
cc1plus: error: unrecognized command line option "-std=c++11"
cc1plus: error: unrecognized command line option "-std=c++11"
cc1plus: error: unrecognized command line option "-std=c++11"
cc1plus: error: unrecognized command line option "-std=c++11"
cc1plus: error: unrecognized command line option "-std=c++11"
cc1plus: error: unrecognized command line option "-std=c++11"
cc1plus: error: unrecognized command line option "-std=c++11"
cc1plus: error: unrecognized command line option "-std=c++11"
cc1plus: error: unrecognized command line option "-std=c++11"
cc1plus: error: unrecognized command line option "-std=c++11"
cc1plus: error: unrecognized command line option "-std=c++11"
cc1plus: error: unrecognized command line option "-std=c++11"
cc1plus: error: unrecognized command line option "-std=c++11"
cc1plus: error: unrecognized command line option "-std=c++11"
cc1plus: error: unrecognized command line option "-std=c++11"
cc1plus: error: unrecognized command line option "-std=c++11"
cc1plus: error: unrecognized command line option "-std=c++11"
cc1plus: error: unrecognized command line option "-std=c++11"
cc1plus: error: unrecognized command line option "-std=c++11"
cc1plus: error: unrecognized command line option "-std=c++11"
cc1plus: error: unrecognized command line option "-std=c++11"
cc1plus: error: unrecognized command line option "-std=c++11"
cc1plus: error: unrecognized command line option "-std=c++11"
cc1plus: error: unrecognized command line option "-std=c++11"
cc1plus: error: unrecognized command line option "-std=c++11"
cc1plus: error: unrecognized command line option "-std=c++11"
cc1plus: error: unrecognized command line option "-std=c++11"
cc1plus: error: unrecognized command line option "-std=c++11"
cc1plus: error: unrecognized command line option "-std=c++11"
cc1plus: error: unrecognized command line option "-std=c++11"
cc1plus: error: unrecognized command line option "-std=c++11"
cc1plus: error: unrecognized command line option "-std=c++11"
cc1plus: error: unrecognized command line option "-std=c++11"
cc1plus: error: unrecognized command line option "-std=c++11"
cc1plus: error: unrecognized command line option "-std=c++11"
cc1plus: error: unrecognized command line option "-std=c++11"
cc1plus: error: unrecognized command line option "-std=c++11"
cc1plus: error: unrecognized command line option "-std=c++11"
cc1plus: error: unrecognized command line option "-std=c++11"
cc1plus: error: unrecognized command line option "-std=c++11"
  GEN      util/build_version.cc
cc1plus: error: unrecognized command line option "-std=c++11"
cc1plus: error: unrecognized command line option "-std=c++11"
cc1plus: error: unrecognized command line option "-std=c++11"
cc1plus: error: unrecognized command line option "-std=c++11"
cc1plus: error: unrecognized command line option "-std=c++11"
cc1plus: error: unrecognized command line option "-std=c++11"
cc1plus: error: unrecognized command line option "-std=c++11"
cc1plus: error: unrecognized command line option "-std=c++11"
cc1plus: error: unrecognized command line option "-std=c++11"
cc1plus: error: unrecognized command line option "-std=c++11"
cc1plus: error: unrecognized command line option "-std=c++11"
cc1plus: error: unrecognized command line option "-std=c++11"
cc1plus: error: unrecognized command line option "-std=c++11"
cc1plus: error: unrecognized command line option "-std=c++11"
cc1plus: error: unrecognized command line option "-std=c++11"
cc1plus: error: unrecognized command line option "-std=c++11"
cc1plus: error: unrecognized command line option "-std=c++11"
cc1plus: error: unrecognized command line option "-std=c++11"
cc1plus: error: unrecognized command line option "-std=c++11"
cc1plus: error: unrecognized command line option "-std=c++11"
cc1plus: error: unrecognized command line option "-std=c++11"
cc1plus: error: unrecognized command line option "-std=c++11"
cc1plus: error: unrecognized command line option "-std=c++11"
cc1plus: error: unrecognized command line option "-std=c++11"
cc1plus: error: unrecognized command line option "-std=c++11"
cc1plus: error: unrecognized command line option "-std=c++11"
cc1plus: error: unrecognized command line option "-std=c++11"
cc1plus: error: unrecognized command line option "-std=c++11"
cc1plus: error: unrecognized command line option "-std=c++11"
cc1plus: error: unrecognized command line option "-std=c++11"
cc1plus: error: unrecognized command line option "-std=c++11"
cc1plus: error: unrecognized command line option "-std=c++11"
cc1plus: error: unrecognized command line option "-std=c++11"
cc1plus: error: unrecognized command line option "-std=c++11"
cc1plus: error: unrecognized command line option "-std=c++11"
cc1plus: error: unrecognized command line option "-std=c++11"
cc1plus: error: unrecognized command line option "-std=c++11"
cc1plus: error: unrecognized command line option "-std=c++11"
cc1plus: error: unrecognized command line option "-std=c++11"
cc1plus: error: unrecognized command line option "-std=c++11"
cc1plus: error: unrecognized command line option "-std=c++11"
cc1plus: error: unrecognized command line option "-std=c++11"
cc1plus: error: unrecognized command line option "-std=c++11"
cc1plus: error: unrecognized command line option "-std=c++11"
cc1plus: error: unrecognized command line option "-std=c++11"
cc1plus: error: unrecognized command line option "-std=c++11"
cc1plus: error: unrecognized command line option "-std=c++11"
cc1plus: error: unrecognized command line option "-std=c++11"
cc1plus: error: unrecognized command line option "-std=c++11"
cc1plus: error: unrecognized command line option "-std=c++11"
cc1plus: error: unrecognized command line option "-std=c++11"
cc1plus: error: unrecognized command line option "-std=c++11"
cc1plus: error: unrecognized command line option "-std=c++11"
cc1plus: error: unrecognized command line option "-std=c++11"
cc1plus: error: unrecognized command line option "-std=c++11"
cc1plus: error: unrecognized command line option "-std=c++11"
cc1plus: error: unrecognized command line option "-std=c++11"
cc1plus: error: unrecognized command line option "-std=c++11"
cc1plus: error: unrecognized command line option "-std=c++11"
cc1plus: error: unrecognized command line option "-std=c++11"
cc1plus: error: unrecognized command line option "-std=c++11"
cc1plus: error: unrecognized command line option "-std=c++11"
cc1plus: error: unrecognized command line option "-std=c++11"
cc1plus: error: unrecognized command line option "-std=c++11"
cc1plus: error: unrecognized command line option "-std=c++11"
cc1plus: error: unrecognized command line option "-std=c++11"
cc1plus: error: unrecognized command line option "-std=c++11"
cc1plus: error: unrecognized command line option "-std=c++11"
cc1plus: error: unrecognized command line option "-std=c++11"
cc1plus: error: unrecognized command line option "-std=c++11"
cc1plus: error: unrecognized command line option "-std=c++11"
cc1plus: error: unrecognized command line option "-std=c++11"
cc1plus: error: unrecognized command line option "-std=c++11"
cc1plus: error: unrecognized command line option "-std=c++11"
cc1plus: error: unrecognized command line option "-std=c++11"
cc1plus: error: unrecognized command line option "-std=c++11"
cc1plus: error: unrecognized command line option "-std=c++11"
cc1plus: error: unrecognized command line option "-std=c++11"
cc1plus: error: unrecognized command line option "-std=c++11"
cc1plus: error: unrecognized command line option "-std=c++11"
cc1plus: error: unrecognized command line option "-std=c++11"
cc1plus: error: unrecognized command line option "-std=c++11"
cc1plus: error: unrecognized command line option "-std=c++11"
cc1plus: error: unrecognized command line option "-std=c++11"
cc1plus: error: unrecognized command line option "-std=c++11"
cc1plus: error: unrecognized command line option "-std=c++11"
cc1plus: error: unrecognized command line option "-std=c++11"
cc1plus: error: unrecognized command line option "-std=c++11"
  CC       db/auto_roll_logger.o
cc1plus: error: unrecognized command line option "-std=c++11"
make[4]: *** [db/auto_roll_logger.o] Error 1
  CC       db/builder.o
cc1plus: error: unrecognized command line option "-std=c++11"
make[4]: *** [db/builder.o] Error 1
  CC       db/c.o
cc1plus: error: unrecognized command line option "-std=c++11"
make[4]: *** [db/c.o] Error 1
  CC       db/column_family.o
cc1plus: error: unrecognized command line option "-std=c++11"
make[4]: *** [db/column_family.o] Error 1
  CC       db/compacted_db_impl.o
cc1plus: error: unrecognized command line option "-std=c++11"
make[4]: *** [db/compacted_db_impl.o] Error 1
  CC       db/compaction.o
cc1plus: error: unrecognized command line option "-std=c++11"
make[4]: *** [db/compaction.o] Error 1
  CC       db/compaction_iterator.o
cc1plus: error: unrecognized command line option "-std=c++11"
make[4]: *** [db/compaction_iterator.o] Error 1
  CC       db/compaction_job.o
cc1plus: error: unrecognized command line option "-std=c++11"
make[4]: *** [db/compaction_job.o] Error 1
  CC       db/compaction_picker.o
cc1plus: error: unrecognized command line option "-std=c++11"
make[4]: *** [db/compaction_picker.o] Error 1
  CC       db/convenience.o
cc1plus: error: unrecognized command line option "-std=c++11"
make[4]: *** [db/convenience.o] Error 1
  CC       db/db_filesnapshot.o
cc1plus: error: unrecognized command line option "-std=c++11"
make[4]: *** [db/db_filesnapshot.o] Error 1
  CC       db/dbformat.o
cc1plus: error: unrecognized command line option "-std=c++11"
make[4]: *** [db/dbformat.o] Error 1
  CC       db/db_impl.o
cc1plus: error: unrecognized command line option "-std=c++11"
make[4]: *** [db/db_impl.o] Error 1
  CC       db/db_impl_debug.o
cc1plus: error: unrecognized command line option "-std=c++11"
make[4]: *** [db/db_impl_debug.o] Error 1
  CC       db/db_impl_readonly.o
cc1plus: error: unrecognized command line option "-std=c++11"
make[4]: *** [db/db_impl_readonly.o] Error 1
  CC       db/db_impl_experimental.o
cc1plus: error: unrecognized command line option "-std=c++11"
make[4]: *** [db/db_impl_experimental.o] Error 1
  CC       db/db_impl_add_file.o
cc1plus: error: unrecognized command line option "-std=c++11"
make[4]: *** [db/db_impl_add_file.o] Error 1
  CC       db/db_info_dumper.o
cc1plus: error: unrecognized command line option "-std=c++11"
make[4]: *** [db/db_info_dumper.o] Error 1
  CC       db/db_iter.o
cc1plus: error: unrecognized command line option "-std=c++11"
make[4]: *** [db/db_iter.o] Error 1
  CC       db/experimental.o
cc1plus: error: unrecognized command line option "-std=c++11"
make[4]: *** [db/experimental.o] Error 1
  CC       db/event_helpers.o
cc1plus: error: unrecognized command line option "-std=c++11"
make[4]: *** [db/event_helpers.o] Error 1
  CC       db/file_indexer.o
cc1plus: error: unrecognized command line option "-std=c++11"
make[4]: *** [db/file_indexer.o] Error 1
  CC       db/filename.o
cc1plus: error: unrecognized command line option "-std=c++11"
make[4]: *** [db/filename.o] Error 1
  CC       db/flush_job.o
cc1plus: error: unrecognized command line option "-std=c++11"
make[4]: *** [db/flush_job.o] Error 1
  CC       db/flush_scheduler.o
cc1plus: error: unrecognized command line option "-std=c++11"
make[4]: *** [db/flush_scheduler.o] Error 1
  CC       db/forward_iterator.o
cc1plus: error: unrecognized command line option "-std=c++11"
make[4]: *** [db/forward_iterator.o] Error 1
  CC       db/internal_stats.o
cc1plus: error: unrecognized command line option "-std=c++11"
make[4]: *** [db/internal_stats.o] Error 1
  CC       db/log_reader.o
cc1plus: error: unrecognized command line option "-std=c++11"
make[4]: *** [db/log_reader.o] Error 1
  CC       db/log_writer.o
cc1plus: error: unrecognized command line option "-std=c++11"
make[4]: *** [db/log_writer.o] Error 1
  CC       db/managed_iterator.o
cc1plus: error: unrecognized command line option "-std=c++11"
make[4]: *** [db/managed_iterator.o] Error 1
  CC       db/memtable_allocator.o
cc1plus: error: unrecognized command line option "-std=c++11"
make[4]: *** [db/memtable_allocator.o] Error 1
  CC       db/memtable.o
cc1plus: error: unrecognized command line option "-std=c++11"
make[4]: *** [db/memtable.o] Error 1
  CC       db/memtable_list.o
cc1plus: error: unrecognized command line option "-std=c++11"
make[4]: *** [db/memtable_list.o] Error 1
  CC       db/merge_helper.o
cc1plus: error: unrecognized command line option "-std=c++11"
make[4]: *** [db/merge_helper.o] Error 1
  CC       db/merge_operator.o
cc1plus: error: unrecognized command line option "-std=c++11"
make[4]: *** [db/merge_operator.o] Error 1
  CC       db/repair.o
cc1plus: error: unrecognized command line option "-std=c++11"
make[4]: *** [db/repair.o] Error 1
  CC       db/snapshot_impl.o
cc1plus: error: unrecognized command line option "-std=c++11"
make[4]: *** [db/snapshot_impl.o] Error 1
  CC       db/table_cache.o
cc1plus: error: unrecognized command line option "-std=c++11"
make[4]: *** [db/table_cache.o] Error 1
  CC       db/table_properties_collector.o
cc1plus: error: unrecognized command line option "-std=c++11"
make[4]: *** [db/table_properties_collector.o] Error 1
  CC       db/transaction_log_impl.o
cc1plus: error: unrecognized command line option "-std=c++11"
make[4]: *** [db/transaction_log_impl.o] Error 1
  CC       db/version_builder.o
cc1plus: error: unrecognized command line option "-std=c++11"
make[4]: *** [db/version_builder.o] Error 1
  CC       db/version_edit.o
cc1plus: error: unrecognized command line option "-std=c++11"
make[4]: *** [db/version_edit.o] Error 1
  CC       db/version_set.o
cc1plus: error: unrecognized command line option "-std=c++11"
make[4]: *** [db/version_set.o] Error 1
  CC       db/wal_manager.o
cc1plus: error: unrecognized command line option "-std=c++11"
make[4]: *** [db/wal_manager.o] Error 1
  CC       db/write_batch.o
cc1plus: error: unrecognized command line option "-std=c++11"
make[4]: *** [db/write_batch.o] Error 1
  CC       db/write_batch_base.o
cc1plus: error: unrecognized command line option "-std=c++11"
make[4]: *** [db/write_batch_base.o] Error 1
  CC       db/write_controller.o
cc1plus: error: unrecognized command line option "-std=c++11"
make[4]: *** [db/write_controller.o] Error 1
  CC       db/write_thread.o
cc1plus: error: unrecognized command line option "-std=c++11"
make[4]: *** [db/write_thread.o] Error 1
  CC       db/xfunc_test_points.o
cc1plus: error: unrecognized command line option "-std=c++11"
make[4]: *** [db/xfunc_test_points.o] Error 1
  CC       memtable/hash_cuckoo_rep.o
cc1plus: error: unrecognized command line option "-std=c++11"
make[4]: *** [memtable/hash_cuckoo_rep.o] Error 1
  CC       memtable/hash_linklist_rep.o
cc1plus: error: unrecognized command line option "-std=c++11"
make[4]: *** [memtable/hash_linklist_rep.o] Error 1
  CC       memtable/hash_skiplist_rep.o
cc1plus: error: unrecognized command line option "-std=c++11"
make[4]: *** [memtable/hash_skiplist_rep.o] Error 1
  CC       memtable/skiplistrep.o
cc1plus: error: unrecognized command line option "-std=c++11"
make[4]: *** [memtable/skiplistrep.o] Error 1
  CC       memtable/vectorrep.o
cc1plus: error: unrecognized command line option "-std=c++11"
make[4]: *** [memtable/vectorrep.o] Error 1
  CC       port/stack_trace.o
cc1plus: error: unrecognized command line option "-std=c++11"
make[4]: *** [port/stack_trace.o] Error 1
  CC       port/port_posix.o
cc1plus: error: unrecognized command line option "-std=c++11"
make[4]: *** [port/port_posix.o] Error 1
  CC       table/adaptive_table_factory.o
cc1plus: error: unrecognized command line option "-std=c++11"
make[4]: *** [table/adaptive_table_factory.o] Error 1
  CC       table/block_based_filter_block.o
cc1plus: error: unrecognized command line option "-std=c++11"
make[4]: *** [table/block_based_filter_block.o] Error 1
  CC       table/block_based_table_builder.o
cc1plus: error: unrecognized command line option "-std=c++11"
make[4]: *** [table/block_based_table_builder.o] Error 1
  CC       table/block_based_table_factory.o
cc1plus: error: unrecognized command line option "-std=c++11"
make[4]: *** [table/block_based_table_factory.o] Error 1
  CC       table/block_based_table_reader.o
cc1plus: error: unrecognized command line option "-std=c++11"
make[4]: *** [table/block_based_table_reader.o] Error 1
  CC       table/block_builder.o
cc1plus: error: unrecognized command line option "-std=c++11"
make[4]: *** [table/block_builder.o] Error 1
  CC       table/block.o
cc1plus: error: unrecognized command line option "-std=c++11"
make[4]: *** [table/block.o] Error 1
  CC       table/block_prefix_index.o
cc1plus: error: unrecognized command line option "-std=c++11"
make[4]: *** [table/block_prefix_index.o] Error 1
  CC       table/bloom_block.o
cc1plus: error: unrecognized command line option "-std=c++11"
make[4]: *** [table/bloom_block.o] Error 1
  CC       table/cuckoo_table_builder.o
cc1plus: error: unrecognized command line option "-std=c++11"
make[4]: *** [table/cuckoo_table_builder.o] Error 1
  CC       table/cuckoo_table_factory.o
cc1plus: error: unrecognized command line option "-std=c++11"
make[4]: *** [table/cuckoo_table_factory.o] Error 1
  CC       table/cuckoo_table_reader.o
cc1plus: error: unrecognized command line option "-std=c++11"
make[4]: *** [table/cuckoo_table_reader.o] Error 1
  CC       table/flush_block_policy.o
cc1plus: error: unrecognized command line option "-std=c++11"
make[4]: *** [table/flush_block_policy.o] Error 1
  CC       table/format.o
cc1plus: error: unrecognized command line option "-std=c++11"
make[4]: *** [table/format.o] Error 1
  CC       table/full_filter_block.o
cc1plus: error: unrecognized command line option "-std=c++11"
make[4]: *** [table/full_filter_block.o] Error 1
  CC       table/get_context.o
cc1plus: error: unrecognized command line option "-std=c++11"
make[4]: *** [table/get_context.o] Error 1
  CC       table/iterator.o
cc1plus: error: unrecognized command line option "-std=c++11"
make[4]: *** [table/iterator.o] Error 1
  CC       table/merger.o
cc1plus: error: unrecognized command line option "-std=c++11"
make[4]: *** [table/merger.o] Error 1
  CC       table/meta_blocks.o
cc1plus: error: unrecognized command line option "-std=c++11"
make[4]: *** [table/meta_blocks.o] Error 1
  CC       table/sst_file_writer.o
cc1plus: error: unrecognized command line option "-std=c++11"
make[4]: *** [table/sst_file_writer.o] Error 1
  CC       table/plain_table_builder.o
cc1plus: error: unrecognized command line option "-std=c++11"
make[4]: *** [table/plain_table_builder.o] Error 1
  CC       table/plain_table_factory.o
cc1plus: error: unrecognized command line option "-std=c++11"
make[4]: *** [table/plain_table_factory.o] Error 1
  CC       table/plain_table_index.o
cc1plus: error: unrecognized command line option "-std=c++11"
make[4]: *** [table/plain_table_index.o] Error 1
  CC       table/plain_table_key_coding.o
cc1plus: error: unrecognized command line option "-std=c++11"
make[4]: *** [table/plain_table_key_coding.o] Error 1
  CC       table/plain_table_reader.o
cc1plus: error: unrecognized command line option "-std=c++11"
make[4]: *** [table/plain_table_reader.o] Error 1
  CC       table/persistent_cache_helper.o
cc1plus: error: unrecognized command line option "-std=c++11"
make[4]: *** [table/persistent_cache_helper.o] Error 1
  CC       table/table_properties.o
cc1plus: error: unrecognized command line option "-std=c++11"
make[4]: *** [table/table_properties.o] Error 1
  CC       table/two_level_iterator.o
cc1plus: error: unrecognized command line option "-std=c++11"
make[4]: *** [table/two_level_iterator.o] Error 1
  CC       tools/dump/db_dump_tool.o
cc1plus: error: unrecognized command line option "-std=c++11"
make[4]: *** [tools/dump/db_dump_tool.o] Error 1
  CC       util/arena.o
cc1plus: error: unrecognized command line option "-std=c++11"
make[4]: *** [util/arena.o] Error 1
  CC       util/bloom.o
cc1plus: error: unrecognized command line option "-std=c++11"
make[4]: *** [util/bloom.o] Error 1
  CC       util/build_version.o
cc1plus: error: unrecognized command line option "-std=c++11"
make[4]: *** [util/build_version.o] Error 1
  CC       util/coding.o
cc1plus: error: unrecognized command line option "-std=c++11"
make[4]: *** [util/coding.o] Error 1
  CC       util/comparator.o
cc1plus: error: unrecognized command line option "-std=c++11"
make[4]: *** [util/comparator.o] Error 1
  CC       util/compaction_job_stats_impl.o
cc1plus: error: unrecognized command line option "-std=c++11"
make[4]: *** [util/compaction_job_stats_impl.o] Error 1
  CC       util/concurrent_arena.o
cc1plus: error: unrecognized command line option "-std=c++11"
make[4]: *** [util/concurrent_arena.o] Error 1
  CC       util/crc32c.o
cc1plus: error: unrecognized command line option "-std=c++11"
make[4]: *** [util/crc32c.o] Error 1
  CC       util/delete_scheduler.o
cc1plus: error: unrecognized command line option "-std=c++11"
make[4]: *** [util/delete_scheduler.o] Error 1
  CC       util/dynamic_bloom.o
cc1plus: error: unrecognized command line option "-std=c++11"
make[4]: *** [util/dynamic_bloom.o] Error 1
  CC       util/env.o
cc1plus: error: unrecognized command line option "-std=c++11"
make[4]: *** [util/env.o] Error 1
  CC       util/env_chroot.o
cc1plus: error: unrecognized command line option "-std=c++11"
make[4]: *** [util/env_chroot.o] Error 1
  CC       util/env_hdfs.o
cc1plus: error: unrecognized command line option "-std=c++11"
make[4]: *** [util/env_hdfs.o] Error 1
  CC       util/env_posix.o
cc1plus: error: unrecognized command line option "-std=c++11"
make[4]: *** [util/env_posix.o] Error 1
  CC       util/file_util.o
cc1plus: error: unrecognized command line option "-std=c++11"
make[4]: *** [util/file_util.o] Error 1
  CC       util/file_reader_writer.o
cc1plus: error: unrecognized command line option "-std=c++11"
make[4]: *** [util/file_reader_writer.o] Error 1
  CC       util/filter_policy.o
cc1plus: error: unrecognized command line option "-std=c++11"
make[4]: *** [util/filter_policy.o] Error 1
  CC       util/hash.o
cc1plus: error: unrecognized command line option "-std=c++11"
make[4]: *** [util/hash.o] Error 1
  CC       util/histogram.o
cc1plus: error: unrecognized command line option "-std=c++11"
make[4]: *** [util/histogram.o] Error 1
  CC       util/histogram_windowing.o
cc1plus: error: unrecognized command line option "-std=c++11"
make[4]: *** [util/histogram_windowing.o] Error 1
  CC       util/instrumented_mutex.o
cc1plus: error: unrecognized command line option "-std=c++11"
make[4]: *** [util/instrumented_mutex.o] Error 1
  CC       util/iostats_context.o
cc1plus: error: unrecognized command line option "-std=c++11"
make[4]: *** [util/iostats_context.o] Error 1
  CC       util/io_posix.o
cc1plus: error: unrecognized command line option "-std=c++11"
make[4]: *** [util/io_posix.o] Error 1
  CC       util/lru_cache.o
cc1plus: error: unrecognized command line option "-std=c++11"
make[4]: *** [util/lru_cache.o] Error 1
  CC       util/threadpool.o
cc1plus: error: unrecognized command line option "-std=c++11"
make[4]: *** [util/threadpool.o] Error 1
  CC       util/transaction_test_util.o
cc1plus: error: unrecognized command line option "-std=c++11"
make[4]: *** [util/transaction_test_util.o] Error 1
  CC       util/sharded_cache.o
cc1plus: error: unrecognized command line option "-std=c++11"
make[4]: *** [util/sharded_cache.o] Error 1
  CC       util/sst_file_manager_impl.o
cc1plus: error: unrecognized command line option "-std=c++11"
make[4]: *** [util/sst_file_manager_impl.o] Error 1
  CC       utilities/backupable/backupable_db.o
cc1plus: error: unrecognized command line option "-std=c++11"
make[4]: *** [utilities/backupable/backupable_db.o] Error 1
  CC       utilities/convenience/info_log_finder.o
cc1plus: error: unrecognized command line option "-std=c++11"
make[4]: *** [utilities/convenience/info_log_finder.o] Error 1
  CC       utilities/checkpoint/checkpoint.o
cc1plus: error: unrecognized command line option "-std=c++11"
make[4]: *** [utilities/checkpoint/checkpoint.o] Error 1
  CC       utilities/compaction_filters/remove_emptyvalue_compactionfilter.o
cc1plus: error: unrecognized command line option "-std=c++11"
make[4]: *** [utilities/compaction_filters/remove_emptyvalue_compactionfilter.o] Error 1
  CC       utilities/document/document_db.o
cc1plus: error: unrecognized command line option "-std=c++11"
make[4]: *** [utilities/document/document_db.o] Error 1
  CC       utilities/document/json_document_builder.o
cc1plus: error: unrecognized command line option "-std=c++11"
make[4]: *** [utilities/document/json_document_builder.o] Error 1
  CC       utilities/document/json_document.o
cc1plus: error: unrecognized command line option "-std=c++11"
make[4]: *** [utilities/document/json_document.o] Error 1
  CC       utilities/env_mirror.o
cc1plus: error: unrecognized command line option "-std=c++11"
make[4]: *** [utilities/env_mirror.o] Error 1
  CC       utilities/env_registry.o
cc1plus: error: unrecognized command line option "-std=c++11"
make[4]: *** [utilities/env_registry.o] Error 1
  CC       utilities/flashcache/flashcache.o
cc1plus: error: unrecognized command line option "-std=c++11"
make[4]: *** [utilities/flashcache/flashcache.o] Error 1
  CC       utilities/geodb/geodb_impl.o
cc1plus: error: unrecognized command line option "-std=c++11"
make[4]: *** [utilities/geodb/geodb_impl.o] Error 1
  CC       utilities/leveldb_options/leveldb_options.o
cc1plus: error: unrecognized command line option "-std=c++11"
make[4]: *** [utilities/leveldb_options/leveldb_options.o] Error 1
  CC       utilities/memory/memory_util.o
cc1plus: error: unrecognized command line option "-std=c++11"
make[4]: *** [utilities/memory/memory_util.o] Error 1
  CC       utilities/merge_operators/put.o
cc1plus: error: unrecognized command line option "-std=c++11"
make[4]: *** [utilities/merge_operators/put.o] Error 1
  CC       utilities/merge_operators/max.o
cc1plus: error: unrecognized command line option "-std=c++11"
make[4]: *** [utilities/merge_operators/max.o] Error 1
  CC       utilities/merge_operators/string_append/stringappend2.o
cc1plus: error: unrecognized command line option "-std=c++11"
make[4]: *** [utilities/merge_operators/string_append/stringappend2.o] Error 1
  CC       utilities/merge_operators/string_append/stringappend.o
cc1plus: error: unrecognized command line option "-std=c++11"
make[4]: *** [utilities/merge_operators/string_append/stringappend.o] Error 1
  CC       utilities/merge_operators/uint64add.o
cc1plus: error: unrecognized command line option "-std=c++11"
make[4]: *** [utilities/merge_operators/uint64add.o] Error 1
  CC       utilities/option_change_migration/option_change_migration.o
cc1plus: error: unrecognized command line option "-std=c++11"
make[4]: *** [utilities/option_change_migration/option_change_migration.o] Error 1
  CC       utilities/options/options_util.o
cc1plus: error: unrecognized command line option "-std=c++11"
make[4]: *** [utilities/options/options_util.o] Error 1
  CC       utilities/persistent_cache/persistent_cache_tier.o
cc1plus: error: unrecognized command line option "-std=c++11"
make[4]: *** [utilities/persistent_cache/persistent_cache_tier.o] Error 1
  CC       utilities/persistent_cache/volatile_tier_impl.o
cc1plus: error: unrecognized command line option "-std=c++11"
make[4]: *** [utilities/persistent_cache/volatile_tier_impl.o] Error 1
  CC       utilities/persistent_cache/block_cache_tier_file.o
cc1plus: error: unrecognized command line option "-std=c++11"
make[4]: *** [utilities/persistent_cache/block_cache_tier_file.o] Error 1
  CC       utilities/persistent_cache/block_cache_tier_metadata.o
cc1plus: error: unrecognized command line option "-std=c++11"
make[4]: *** [utilities/persistent_cache/block_cache_tier_metadata.o] Error 1
  CC       utilities/redis/redis_lists.o
cc1plus: error: unrecognized command line option "-std=c++11"
make[4]: *** [utilities/redis/redis_lists.o] Error 1
  CC       utilities/simulator_cache/sim_cache.o
cc1plus: error: unrecognized command line option "-std=c++11"
make[4]: *** [utilities/simulator_cache/sim_cache.o] Error 1
  CC       utilities/spatialdb/spatial_db.o
cc1plus: error: unrecognized command line option "-std=c++11"
make[4]: *** [utilities/spatialdb/spatial_db.o] Error 1
  CC       utilities/table_properties_collectors/compact_on_deletion_collector.o
cc1plus: error: unrecognized command line option "-std=c++11"
make[4]: *** [utilities/table_properties_collectors/compact_on_deletion_collector.o] Erro                                                       r 1
  CC       utilities/transactions/optimistic_transaction_impl.o
cc1plus: error: unrecognized command line option "-std=c++11"
make[4]: *** [utilities/transactions/optimistic_transaction_impl.o] Error 1
  CC       utilities/transactions/optimistic_transaction_db_impl.o
cc1plus: error: unrecognized command line option "-std=c++11"
make[4]: *** [utilities/transactions/optimistic_transaction_db_impl.o] Error 1
  CC       utilities/transactions/transaction_base.o
cc1plus: error: unrecognized command line option "-std=c++11"
make[4]: *** [utilities/transactions/transaction_base.o] Error 1
  CC       utilities/transactions/transaction_db_impl.o
cc1plus: error: unrecognized command line option "-std=c++11"
make[4]: *** [utilities/transactions/transaction_db_impl.o] Error 1
  CC       utilities/transactions/transaction_db_mutex_impl.o
cc1plus: error: unrecognized command line option "-std=c++11"
make[4]: *** [utilities/transactions/transaction_db_mutex_impl.o] Error 1
  CC       utilities/transactions/transaction_lock_mgr.o
cc1plus: error: unrecognized command line option "-std=c++11"
make[4]: *** [utilities/transactions/transaction_lock_mgr.o] Error 1
  CC       utilities/transactions/transaction_impl.o
cc1plus: error: unrecognized command line option "-std=c++11"
make[4]: *** [utilities/transactions/transaction_impl.o] Error 1
  CC       utilities/transactions/transaction_util.o
cc1plus: error: unrecognized command line option "-std=c++11"
make[4]: *** [utilities/transactions/transaction_util.o] Error 1
  CC       utilities/ttl/db_ttl_impl.o
cc1plus: error: unrecognized command line option "-std=c++11"
make[4]: *** [utilities/ttl/db_ttl_impl.o] Error 1
  CC       utilities/write_batch_with_index/write_batch_with_index.o
cc1plus: error: unrecognized command line option "-std=c++11"
make[4]: *** [utilities/write_batch_with_index/write_batch_with_index.o] Error 1
  CC       utilities/write_batch_with_index/write_batch_with_index_internal.o
cc1plus: error: unrecognized command line option "-std=c++11"
make[4]: *** [utilities/write_batch_with_index/write_batch_with_index_internal.o] Error 1
  CC       util/event_logger.o
cc1plus: error: unrecognized command line option "-std=c++11"
make[4]: *** [util/event_logger.o] Error 1
  CC       util/log_buffer.o
cc1plus: error: unrecognized command line option "-std=c++11"
make[4]: *** [util/log_buffer.o] Error 1
  CC       util/logging.o
cc1plus: error: unrecognized command line option "-std=c++11"
make[4]: *** [util/logging.o] Error 1
  CC       util/memenv.o
cc1plus: error: unrecognized command line option "-std=c++11"
make[4]: *** [util/memenv.o] Error 1
  CC       util/murmurhash.o
cc1plus: error: unrecognized command line option "-std=c++11"
make[4]: *** [util/murmurhash.o] Error 1
  CC       util/mutable_cf_options.o
cc1plus: error: unrecognized command line option "-std=c++11"
make[4]: *** [util/mutable_cf_options.o] Error 1
  CC       util/options.o
cc1plus: error: unrecognized command line option "-std=c++11"
make[4]: *** [util/options.o] Error 1
  CC       util/options_helper.o
cc1plus: error: unrecognized command line option "-std=c++11"
make[4]: *** [util/options_helper.o] Error 1
  CC       util/options_parser.o
cc1plus: error: unrecognized command line option "-std=c++11"
make[4]: *** [util/options_parser.o] Error 1
  CC       util/options_sanity_check.o
cc1plus: error: unrecognized command line option "-std=c++11"
make[4]: *** [util/options_sanity_check.o] Error 1
  CC       util/perf_context.o
cc1plus: error: unrecognized command line option "-std=c++11"
make[4]: *** [util/perf_context.o] Error 1
  CC       util/perf_level.o
cc1plus: error: unrecognized command line option "-std=c++11"
make[4]: *** [util/perf_level.o] Error 1
  CC       util/random.o
cc1plus: error: unrecognized command line option "-std=c++11"
make[4]: *** [util/random.o] Error 1
  CC       util/rate_limiter.o
cc1plus: error: unrecognized command line option "-std=c++11"
make[4]: *** [util/rate_limiter.o] Error 1
  CC       util/slice.o
cc1plus: error: unrecognized command line option "-std=c++11"
make[4]: *** [util/slice.o] Error 1
  CC       util/statistics.o
cc1plus: error: unrecognized command line option "-std=c++11"
make[4]: *** [util/statistics.o] Error 1
  CC       util/status.o
cc1plus: error: unrecognized command line option "-std=c++11"
make[4]: *** [util/status.o] Error 1
  CC       util/status_message.o
cc1plus: error: unrecognized command line option "-std=c++11"
make[4]: *** [util/status_message.o] Error 1
  CC       util/string_util.o
cc1plus: error: unrecognized command line option "-std=c++11"
make[4]: *** [util/string_util.o] Error 1
  CC       util/sync_point.o
cc1plus: error: unrecognized command line option "-std=c++11"
make[4]: *** [util/sync_point.o] Error 1
  CC       util/thread_local.o
cc1plus: error: unrecognized command line option "-std=c++11"
make[4]: *** [util/thread_local.o] Error 1
  CC       util/thread_status_impl.o
cc1plus: error: unrecognized command line option "-std=c++11"
make[4]: *** [util/thread_status_impl.o] Error 1
  CC       util/thread_status_updater.o
cc1plus: error: unrecognized command line option "-std=c++11"
make[4]: *** [util/thread_status_updater.o] Error 1
  CC       util/thread_status_updater_debug.o
cc1plus: error: unrecognized command line option "-std=c++11"
make[4]: *** [util/thread_status_updater_debug.o] Error 1
  CC       util/thread_status_util.o
cc1plus: error: unrecognized command line option "-std=c++11"
make[4]: *** [util/thread_status_util.o] Error 1
  CC       util/thread_status_util_debug.o
cc1plus: error: unrecognized command line option "-std=c++11"
make[4]: *** [util/thread_status_util_debug.o] Error 1
  CC       util/xfunc.o
cc1plus: error: unrecognized command line option "-std=c++11"
make[4]: *** [util/xfunc.o] Error 1
  CC       util/xxhash.o
cc1plus: error: unrecognized command line option "-std=c++11"
make[4]: *** [util/xxhash.o] Error 1
  CC       tools/ldb_cmd.o
cc1plus: error: unrecognized command line option "-std=c++11"
make[4]: *** [tools/ldb_cmd.o] Error 1
  CC       tools/ldb_tool.o
cc1plus: error: unrecognized command line option "-std=c++11"
make[4]: *** [tools/ldb_tool.o] Error 1
  CC       tools/sst_dump_tool.o
cc1plus: error: unrecognized command line option "-std=c++11"
make[4]: *** [tools/sst_dump_tool.o] Error 1
make[4]: Target `static_lib' not remade because of errors.
make[4]: Leaving directory `/var/git/dollarydoos/external/rocksdb'
make[3]: *** [external/CMakeFiles/rocksdb] Error 2
make[3]: Target `external/CMakeFiles/rocksdb.dir/build' not remade because of errors.
make[3]: Leaving directory `/var/git/dollarydoos/build/release'
make[2]: *** [external/CMakeFiles/rocksdb.dir/all] Error 2
make[3]: Entering directory `/var/git/dollarydoos/build/release'
Scanning dependencies of target InProcessNode
make[3]: Leaving directory `/var/git/dollarydoos/build/release'
make[3]: Entering directory `/var/git/dollarydoos/build/release'
[ 27%] Building CXX object src/CMakeFiles/InProcessNode.dir/InProcessNode/InProcessNodeEr                                                       rors.cpp.o
cc1plus: error: invalid option argument ‘-Ofast’
cc1plus: error: -Werror=unused-result: No option -Wunused-result
cc1plus: error: -Werror=maybe-uninitialized: No option -Wmaybe-uninitialized
cc1plus: error: unrecognized command line option "-std=c++11"
make[3]: *** [src/CMakeFiles/InProcessNode.dir/InProcessNode/InProcessNodeErrors.cpp.o] E                                                       rror 1
[ 27%] Building CXX object src/CMakeFiles/InProcessNode.dir/InProcessNode/InProcessNode.c                                                       pp.o
cc1plus: error: invalid option argument ‘-Ofast’
cc1plus: error: -Werror=unused-result: No option -Wunused-result
cc1plus: error: -Werror=maybe-uninitialized: No option -Wmaybe-uninitialized
cc1plus: error: unrecognized command line option "-std=c++11"
make[3]: *** [src/CMakeFiles/InProcessNode.dir/InProcessNode/InProcessNode.cpp.o] Error 1
make[3]: Target `src/CMakeFiles/InProcessNode.dir/build' not remade because of errors.
make[3]: Leaving directory `/var/git/dollarydoos/build/release'
make[2]: *** [src/CMakeFiles/InProcessNode.dir/all] Error 2
make[3]: Entering directory `/var/git/dollarydoos/build/release'
Scanning dependencies of target JsonRpcServer
make[3]: Leaving directory `/var/git/dollarydoos/build/release'
make[3]: Entering directory `/var/git/dollarydoos/build/release'
[ 27%] Building CXX object src/CMakeFiles/JsonRpcServer.dir/JsonRpcServer/JsonRpcServer.c                                                       pp.o
cc1plus: error: invalid option argument ‘-Ofast’
cc1plus: error: -Werror=unused-result: No option -Wunused-result
cc1plus: error: -Werror=maybe-uninitialized: No option -Wmaybe-uninitialized
cc1plus: error: unrecognized command line option "-std=c++11"
make[3]: *** [src/CMakeFiles/JsonRpcServer.dir/JsonRpcServer/JsonRpcServer.cpp.o] Error 1
make[3]: Target `src/CMakeFiles/JsonRpcServer.dir/build' not remade because of errors.
make[3]: Leaving directory `/var/git/dollarydoos/build/release'
make[2]: *** [src/CMakeFiles/JsonRpcServer.dir/all] Error 2
make[3]: Entering directory `/var/git/dollarydoos/build/release'
Scanning dependencies of target NodeRpcProxy
make[3]: Leaving directory `/var/git/dollarydoos/build/release'
make[3]: Entering directory `/var/git/dollarydoos/build/release'
[ 27%] Building CXX object src/CMakeFiles/NodeRpcProxy.dir/NodeRpcProxy/NodeRpcProxy.cpp.                                                       o
cc1plus: error: invalid option argument ‘-Ofast’
cc1plus: error: -Werror=unused-result: No option -Wunused-result
cc1plus: error: -Werror=maybe-uninitialized: No option -Wmaybe-uninitialized
cc1plus: error: unrecognized command line option "-std=c++11"
make[3]: *** [src/CMakeFiles/NodeRpcProxy.dir/NodeRpcProxy/NodeRpcProxy.cpp.o] Error 1
[ 27%] Building CXX object src/CMakeFiles/NodeRpcProxy.dir/NodeRpcProxy/NodeErrors.cpp.o
cc1plus: error: invalid option argument ‘-Ofast’
cc1plus: error: -Werror=unused-result: No option -Wunused-result
cc1plus: error: -Werror=maybe-uninitialized: No option -Wmaybe-uninitialized
cc1plus: error: unrecognized command line option "-std=c++11"
make[3]: *** [src/CMakeFiles/NodeRpcProxy.dir/NodeRpcProxy/NodeErrors.cpp.o] Error 1
make[3]: Target `src/CMakeFiles/NodeRpcProxy.dir/build' not remade because of errors.
make[3]: Leaving directory `/var/git/dollarydoos/build/release'
make[2]: *** [src/CMakeFiles/NodeRpcProxy.dir/all] Error 2
make[3]: Entering directory `/var/git/dollarydoos/build/release'
Scanning dependencies of target PaymentGate
make[3]: Leaving directory `/var/git/dollarydoos/build/release'
make[3]: Entering directory `/var/git/dollarydoos/build/release'
[ 27%] Building CXX object src/CMakeFiles/PaymentGate.dir/PaymentGate/PaymentServiceJsonR                                                       pcServer.cpp.o
cc1plus: error: invalid option argument ‘-Ofast’
cc1plus: error: -Werror=unused-result: No option -Wunused-result
cc1plus: error: -Werror=maybe-uninitialized: No option -Wmaybe-uninitialized
cc1plus: error: unrecognized command line option "-std=c++11"
make[3]: *** [src/CMakeFiles/PaymentGate.dir/PaymentGate/PaymentServiceJsonRpcServer.cpp.                                                       o] Error 1
[ 27%] Building CXX object src/CMakeFiles/PaymentGate.dir/PaymentGate/WalletService.cpp.o
cc1plus: error: invalid option argument ‘-Ofast’
cc1plus: error: -Werror=unused-result: No option -Wunused-result
cc1plus: error: -Werror=maybe-uninitialized: No option -Wmaybe-uninitialized
cc1plus: error: unrecognized command line option "-std=c++11"
make[3]: *** [src/CMakeFiles/PaymentGate.dir/PaymentGate/WalletService.cpp.o] Error 1
[ 28%] Building CXX object src/CMakeFiles/PaymentGate.dir/PaymentGate/NodeFactory.cpp.o
cc1plus: error: invalid option argument ‘-Ofast’
cc1plus: error: -Werror=unused-result: No option -Wunused-result
cc1plus: error: -Werror=maybe-uninitialized: No option -Wmaybe-uninitialized
cc1plus: error: unrecognized command line option "-std=c++11"
make[3]: *** [src/CMakeFiles/PaymentGate.dir/PaymentGate/NodeFactory.cpp.o] Error 1
[ 28%] Building CXX object src/CMakeFiles/PaymentGate.dir/PaymentGate/PaymentServiceJsonR                                                       pcMessages.cpp.o
cc1plus: error: invalid option argument ‘-Ofast’
cc1plus: error: -Werror=unused-result: No option -Wunused-result
cc1plus: error: -Werror=maybe-uninitialized: No option -Wmaybe-uninitialized
cc1plus: error: unrecognized command line option "-std=c++11"
make[3]: *** [src/CMakeFiles/PaymentGate.dir/PaymentGate/PaymentServiceJsonRpcMessages.cp                                                       p.o] Error 1
[ 28%] Building CXX object src/CMakeFiles/PaymentGate.dir/PaymentGate/WalletServiceErrorC                                                       ategory.cpp.o
cc1plus: error: invalid option argument ‘-Ofast’
cc1plus: error: -Werror=unused-result: No option -Wunused-result
cc1plus: error: -Werror=maybe-uninitialized: No option -Wmaybe-uninitialized
cc1plus: error: unrecognized command line option "-std=c++11"
make[3]: *** [src/CMakeFiles/PaymentGate.dir/PaymentGate/WalletServiceErrorCategory.cpp.o                                                       ] Error 1
make[3]: Target `src/CMakeFiles/PaymentGate.dir/build' not remade because of errors.
make[3]: Leaving directory `/var/git/dollarydoos/build/release'
make[2]: *** [src/CMakeFiles/PaymentGate.dir/all] Error 2
make[3]: Entering directory `/var/git/dollarydoos/build/release'
Scanning dependencies of target Transfers
make[3]: Leaving directory `/var/git/dollarydoos/build/release'
make[3]: Entering directory `/var/git/dollarydoos/build/release'
[ 29%] Building CXX object src/CMakeFiles/Transfers.dir/Transfers/SynchronizationState.cp                                                       p.o
cc1plus: error: invalid option argument ‘-Ofast’
cc1plus: error: -Werror=unused-result: No option -Wunused-result
cc1plus: error: -Werror=maybe-uninitialized: No option -Wmaybe-uninitialized
cc1plus: error: unrecognized command line option "-std=c++11"
make[3]: *** [src/CMakeFiles/Transfers.dir/Transfers/SynchronizationState.cpp.o] Error 1
[ 29%] Building CXX object src/CMakeFiles/Transfers.dir/Transfers/TransfersSubscription.c                                                       pp.o
cc1plus: error: invalid option argument ‘-Ofast’
cc1plus: error: -Werror=unused-result: No option -Wunused-result
cc1plus: error: -Werror=maybe-uninitialized: No option -Wmaybe-uninitialized
cc1plus: error: unrecognized command line option "-std=c++11"
make[3]: *** [src/CMakeFiles/Transfers.dir/Transfers/TransfersSubscription.cpp.o] Error 1
[ 29%] Building CXX object src/CMakeFiles/Transfers.dir/Transfers/TransfersSynchronizer.c                                                       pp.o
cc1plus: error: invalid option argument ‘-Ofast’
cc1plus: error: -Werror=unused-result: No option -Wunused-result
cc1plus: error: -Werror=maybe-uninitialized: No option -Wmaybe-uninitialized
cc1plus: error: unrecognized command line option "-std=c++11"
make[3]: *** [src/CMakeFiles/Transfers.dir/Transfers/TransfersSynchronizer.cpp.o] Error 1
[ 30%] Building CXX object src/CMakeFiles/Transfers.dir/Transfers/TransfersConsumer.cpp.o
cc1plus: error: invalid option argument ‘-Ofast’
cc1plus: error: -Werror=unused-result: No option -Wunused-result
cc1plus: error: -Werror=maybe-uninitialized: No option -Wmaybe-uninitialized
cc1plus: error: unrecognized command line option "-std=c++11"
make[3]: *** [src/CMakeFiles/Transfers.dir/Transfers/TransfersConsumer.cpp.o] Error 1
[ 30%] Building CXX object src/CMakeFiles/Transfers.dir/Transfers/TransfersContainer.cpp.                                                       o
cc1plus: error: invalid option argument ‘-Ofast’
cc1plus: error: -Werror=unused-result: No option -Wunused-result
cc1plus: error: -Werror=maybe-uninitialized: No option -Wmaybe-uninitialized
cc1plus: error: unrecognized command line option "-std=c++11"
make[3]: *** [src/CMakeFiles/Transfers.dir/Transfers/TransfersContainer.cpp.o] Error 1
[ 30%] Building CXX object src/CMakeFiles/Transfers.dir/Transfers/BlockchainSynchronizer.                                                       cpp.o
cc1plus: error: invalid option argument ‘-Ofast’
cc1plus: error: -Werror=unused-result: No option -Wunused-result
cc1plus: error: -Werror=maybe-uninitialized: No option -Wmaybe-uninitialized
cc1plus: error: unrecognized command line option "-std=c++11"
make[3]: *** [src/CMakeFiles/Transfers.dir/Transfers/BlockchainSynchronizer.cpp.o] Error                                                        1
make[3]: Target `src/CMakeFiles/Transfers.dir/build' not remade because of errors.
make[3]: Leaving directory `/var/git/dollarydoos/build/release'
make[2]: *** [src/CMakeFiles/Transfers.dir/all] Error 2
make[3]: Entering directory `/var/git/dollarydoos/build/release'
Scanning dependencies of target Wallet
make[3]: Leaving directory `/var/git/dollarydoos/build/release'
make[3]: Entering directory `/var/git/dollarydoos/build/release'
[ 30%] Building CXX object src/CMakeFiles/Wallet.dir/Wallet/WalletErrors.cpp.o
cc1plus: error: invalid option argument ‘-Ofast’
cc1plus: error: -Werror=unused-result: No option -Wunused-result
cc1plus: error: -Werror=maybe-uninitialized: No option -Wmaybe-uninitialized
cc1plus: error: unrecognized command line option "-std=c++11"
make[3]: *** [src/CMakeFiles/Wallet.dir/Wallet/WalletErrors.cpp.o] Error 1
[ 31%] Building CXX object src/CMakeFiles/Wallet.dir/Wallet/WalletUtils.cpp.o
cc1plus: error: invalid option argument ‘-Ofast’
cc1plus: error: -Werror=unused-result: No option -Wunused-result
cc1plus: error: -Werror=maybe-uninitialized: No option -Wmaybe-uninitialized
cc1plus: error: unrecognized command line option "-std=c++11"
make[3]: *** [src/CMakeFiles/Wallet.dir/Wallet/WalletUtils.cpp.o] Error 1
[ 31%] Building CXX object src/CMakeFiles/Wallet.dir/Wallet/WalletGreen.cpp.o
cc1plus: error: invalid option argument ‘-Ofast’
cc1plus: error: -Werror=unused-result: No option -Wunused-result
cc1plus: error: -Werror=maybe-uninitialized: No option -Wmaybe-uninitialized
cc1plus: error: unrecognized command line option "-std=c++11"
make[3]: *** [src/CMakeFiles/Wallet.dir/Wallet/WalletGreen.cpp.o] Error 1
[ 31%] Building CXX object src/CMakeFiles/Wallet.dir/Wallet/WalletAsyncContextCounter.cpp                                                       .o
cc1plus: error: invalid option argument ‘-Ofast’
cc1plus: error: -Werror=unused-result: No option -Wunused-result
cc1plus: error: -Werror=maybe-uninitialized: No option -Wmaybe-uninitialized
cc1plus: error: unrecognized command line option "-std=c++11"
make[3]: *** [src/CMakeFiles/Wallet.dir/Wallet/WalletAsyncContextCounter.cpp.o] Error 1
[ 31%] Building CXX object src/CMakeFiles/Wallet.dir/Wallet/LegacyKeysImporter.cpp.o
cc1plus: error: invalid option argument ‘-Ofast’
cc1plus: error: -Werror=unused-result: No option -Wunused-result
cc1plus: error: -Werror=maybe-uninitialized: No option -Wmaybe-uninitialized
cc1plus: error: unrecognized command line option "-std=c++11"
make[3]: *** [src/CMakeFiles/Wallet.dir/Wallet/LegacyKeysImporter.cpp.o] Error 1
[ 32%] Building CXX object src/CMakeFiles/Wallet.dir/Wallet/WalletSerializationV1.cpp.o
cc1plus: error: invalid option argument ‘-Ofast’
cc1plus: error: -Werror=unused-result: No option -Wunused-result
cc1plus: error: -Werror=maybe-uninitialized: No option -Wmaybe-uninitialized
cc1plus: error: unrecognized command line option "-std=c++11"
make[3]: *** [src/CMakeFiles/Wallet.dir/Wallet/WalletSerializationV1.cpp.o] Error 1
[ 32%] Building CXX object src/CMakeFiles/Wallet.dir/Wallet/WalletSerializationV2.cpp.o
cc1plus: error: invalid option argument ‘-Ofast’
cc1plus: error: -Werror=unused-result: No option -Wunused-result
cc1plus: error: -Werror=maybe-uninitialized: No option -Wmaybe-uninitialized
cc1plus: error: unrecognized command line option "-std=c++11"
make[3]: *** [src/CMakeFiles/Wallet.dir/Wallet/WalletSerializationV2.cpp.o] Error 1
[ 32%] Building CXX object src/CMakeFiles/Wallet.dir/Wallet/WalletRpcServer.cpp.o
cc1plus: error: invalid option argument ‘-Ofast’
cc1plus: error: -Werror=unused-result: No option -Wunused-result
cc1plus: error: -Werror=maybe-uninitialized: No option -Wmaybe-uninitialized
cc1plus: error: unrecognized command line option "-std=c++11"
make[3]: *** [src/CMakeFiles/Wallet.dir/Wallet/WalletRpcServer.cpp.o] Error 1
[ 33%] Building CXX object src/CMakeFiles/Wallet.dir/WalletLegacy/WalletUserTransactionsC                                                       ache.cpp.o
cc1plus: error: invalid option argument ‘-Ofast’
cc1plus: error: -Werror=unused-result: No option -Wunused-result
cc1plus: error: -Werror=maybe-uninitialized: No option -Wmaybe-uninitialized
cc1plus: error: unrecognized command line option "-std=c++11"
make[3]: *** [src/CMakeFiles/Wallet.dir/WalletLegacy/WalletUserTransactionsCache.cpp.o] E                                                       rror 1
[ 33%] Building CXX object src/CMakeFiles/Wallet.dir/WalletLegacy/KeysStorage.cpp.o
cc1plus: error: invalid option argument ‘-Ofast’
cc1plus: error: -Werror=unused-result: No option -Wunused-result
cc1plus: error: -Werror=maybe-uninitialized: No option -Wmaybe-uninitialized
cc1plus: error: unrecognized command line option "-std=c++11"
make[3]: *** [src/CMakeFiles/Wallet.dir/WalletLegacy/KeysStorage.cpp.o] Error 1
[ 33%] Building CXX object src/CMakeFiles/Wallet.dir/WalletLegacy/WalletTransactionSender                                                       .cpp.o
cc1plus: error: invalid option argument ‘-Ofast’
cc1plus: error: -Werror=unused-result: No option -Wunused-result
cc1plus: error: -Werror=maybe-uninitialized: No option -Wmaybe-uninitialized
cc1plus: error: unrecognized command line option "-std=c++11"
make[3]: *** [src/CMakeFiles/Wallet.dir/WalletLegacy/WalletTransactionSender.cpp.o] Error                                                        1
[ 33%] Building CXX object src/CMakeFiles/Wallet.dir/WalletLegacy/WalletHelper.cpp.o
cc1plus: error: invalid option argument ‘-Ofast’
cc1plus: error: -Werror=unused-result: No option -Wunused-result
cc1plus: error: -Werror=maybe-uninitialized: No option -Wmaybe-uninitialized
cc1plus: error: unrecognized command line option "-std=c++11"
make[3]: *** [src/CMakeFiles/Wallet.dir/WalletLegacy/WalletHelper.cpp.o] Error 1
[ 34%] Building CXX object src/CMakeFiles/Wallet.dir/WalletLegacy/WalletLegacy.cpp.o
cc1plus: error: invalid option argument ‘-Ofast’
cc1plus: error: -Werror=unused-result: No option -Wunused-result
cc1plus: error: -Werror=maybe-uninitialized: No option -Wmaybe-uninitialized
cc1plus: error: unrecognized command line option "-std=c++11"
make[3]: *** [src/CMakeFiles/Wallet.dir/WalletLegacy/WalletLegacy.cpp.o] Error 1
[ 34%] Building CXX object src/CMakeFiles/Wallet.dir/WalletLegacy/WalletUnconfirmedTransa                                                       ctions.cpp.o
cc1plus: error: invalid option argument ‘-Ofast’
cc1plus: error: -Werror=unused-result: No option -Wunused-result
cc1plus: error: -Werror=maybe-uninitialized: No option -Wmaybe-uninitialized
cc1plus: error: unrecognized command line option "-std=c++11"
make[3]: *** [src/CMakeFiles/Wallet.dir/WalletLegacy/WalletUnconfirmedTransactions.cpp.o]                                                        Error 1
[ 34%] Building CXX object src/CMakeFiles/Wallet.dir/WalletLegacy/WalletLegacySerializati                                                       on.cpp.o
cc1plus: error: invalid option argument ‘-Ofast’
cc1plus: error: -Werror=unused-result: No option -Wunused-result
cc1plus: error: -Werror=maybe-uninitialized: No option -Wmaybe-uninitialized
cc1plus: error: unrecognized command line option "-std=c++11"
make[3]: *** [src/CMakeFiles/Wallet.dir/WalletLegacy/WalletLegacySerialization.cpp.o] Err                                                       or 1
[ 34%] Building CXX object src/CMakeFiles/Wallet.dir/WalletLegacy/WalletLegacySerializer.                                                       cpp.o
cc1plus: error: invalid option argument ‘-Ofast’
cc1plus: error: -Werror=unused-result: No option -Wunused-result
cc1plus: error: -Werror=maybe-uninitialized: No option -Wmaybe-uninitialized
cc1plus: error: unrecognized command line option "-std=c++11"
make[3]: *** [src/CMakeFiles/Wallet.dir/WalletLegacy/WalletLegacySerializer.cpp.o] Error                                                        1
make[3]: Target `src/CMakeFiles/Wallet.dir/build' not remade because of errors.
make[3]: Leaving directory `/var/git/dollarydoos/build/release'
make[2]: *** [src/CMakeFiles/Wallet.dir/all] Error 2
make[3]: Entering directory `/var/git/dollarydoos/build/release'
Scanning dependencies of target UnitTestsLib
make[3]: Leaving directory `/var/git/dollarydoos/build/release'
make[3]: Entering directory `/var/git/dollarydoos/build/release'
[ 34%] Building CXX object tests/CMakeFiles/UnitTestsLib.dir/UnitTests/TestTransfers.cpp.                                                       o
cc1plus: error: invalid option argument ‘-Ofast’
cc1plus: error: -Werror=unused-result: No option -Wunused-result
cc1plus: error: -Werror=maybe-uninitialized: No option -Wmaybe-uninitialized
cc1plus: error: unrecognized command line option "-std=c++11"
make[3]: *** [tests/CMakeFiles/UnitTestsLib.dir/UnitTests/TestTransfers.cpp.o] Error 1
[ 34%] Building CXX object tests/CMakeFiles/UnitTestsLib.dir/UnitTests/TestTransfersConta                                                       inerKeyImage.cpp.o
cc1plus: error: invalid option argument ‘-Ofast’
cc1plus: error: -Werror=unused-result: No option -Wunused-result
cc1plus: error: -Werror=maybe-uninitialized: No option -Wmaybe-uninitialized
cc1plus: error: unrecognized command line option "-std=c++11"
make[3]: *** [tests/CMakeFiles/UnitTestsLib.dir/UnitTests/TestTransfersContainerKeyImage.                                                       cpp.o] Error 1
[ 34%] Building CXX object tests/CMakeFiles/UnitTestsLib.dir/UnitTests/TestProtocolPack.c                                                       pp.o
cc1plus: error: invalid option argument ‘-Ofast’
cc1plus: error: -Werror=unused-result: No option -Wunused-result
cc1plus: error: -Werror=maybe-uninitialized: No option -Wmaybe-uninitialized
cc1plus: error: unrecognized command line option "-std=c++11"
make[3]: *** [tests/CMakeFiles/UnitTestsLib.dir/UnitTests/TestProtocolPack.cpp.o] Error 1
[ 35%] Building CXX object tests/CMakeFiles/UnitTestsLib.dir/UnitTests/TransactionApiHelp                                                       ers.cpp.o
cc1plus: error: invalid option argument ‘-Ofast’
cc1plus: error: -Werror=unused-result: No option -Wunused-result
cc1plus: error: -Werror=maybe-uninitialized: No option -Wmaybe-uninitialized
cc1plus: error: unrecognized command line option "-std=c++11"
make[3]: *** [tests/CMakeFiles/UnitTestsLib.dir/UnitTests/TransactionApiHelpers.cpp.o] Er                                                       ror 1
[ 35%] Building CXX object tests/CMakeFiles/UnitTestsLib.dir/UnitTests/BinarySerializatio                                                       nCompatibility.cpp.o
cc1plus: error: invalid option argument ‘-Ofast’
cc1plus: error: -Werror=unused-result: No option -Wunused-result
cc1plus: error: -Werror=maybe-uninitialized: No option -Wmaybe-uninitialized
cc1plus: error: unrecognized command line option "-std=c++11"
make[3]: *** [tests/CMakeFiles/UnitTestsLib.dir/UnitTests/BinarySerializationCompatibilit                                                       y.cpp.o] Error 1
[ 35%] Building CXX object tests/CMakeFiles/UnitTestsLib.dir/UnitTests/TestJsonValue.cpp.                                                       o
cc1plus: error: invalid option argument ‘-Ofast’
cc1plus: error: -Werror=unused-result: No option -Wunused-result
cc1plus: error: -Werror=maybe-uninitialized: No option -Wmaybe-uninitialized
cc1plus: error: unrecognized command line option "-std=c++11"
make[3]: *** [tests/CMakeFiles/UnitTestsLib.dir/UnitTests/TestJsonValue.cpp.o] Error 1
[ 36%] Building CXX object tests/CMakeFiles/UnitTestsLib.dir/UnitTests/Base58.cpp.o
cc1plus: error: invalid option argument ‘-Ofast’
cc1plus: error: -Werror=unused-result: No option -Wunused-result
cc1plus: error: -Werror=maybe-uninitialized: No option -Wmaybe-uninitialized
cc1plus: error: unrecognized command line option "-std=c++11"
make[3]: *** [tests/CMakeFiles/UnitTestsLib.dir/UnitTests/Base58.cpp.o] Error 1
[ 36%] Building CXX object tests/CMakeFiles/UnitTestsLib.dir/UnitTests/EventWaiter.cpp.o
cc1plus: error: invalid option argument ‘-Ofast’
cc1plus: error: -Werror=unused-result: No option -Wunused-result
cc1plus: error: -Werror=maybe-uninitialized: No option -Wmaybe-uninitialized
cc1plus: error: unrecognized command line option "-std=c++11"
make[3]: *** [tests/CMakeFiles/UnitTestsLib.dir/UnitTests/EventWaiter.cpp.o] Error 1
[ 36%] Building CXX object tests/CMakeFiles/UnitTestsLib.dir/UnitTests/DecomposeAmountInt                                                       oDigits.cpp.o
cc1plus: error: invalid option argument ‘-Ofast’
cc1plus: error: -Werror=unused-result: No option -Wunused-result
cc1plus: error: -Werror=maybe-uninitialized: No option -Wmaybe-uninitialized
cc1plus: error: unrecognized command line option "-std=c++11"
make[3]: *** [tests/CMakeFiles/UnitTestsLib.dir/UnitTests/DecomposeAmountIntoDigits.cpp.o                                                       ] Error 1
[ 36%] Building CXX object tests/CMakeFiles/UnitTestsLib.dir/UnitTests/TestPeerlist.cpp.o
cc1plus: error: invalid option argument ‘-Ofast’
cc1plus: error: -Werror=unused-result: No option -Wunused-result
cc1plus: error: -Werror=maybe-uninitialized: No option -Wmaybe-uninitialized
cc1plus: error: unrecognized command line option "-std=c++11"
make[3]: *** [tests/CMakeFiles/UnitTestsLib.dir/UnitTests/TestPeerlist.cpp.o] Error 1
[ 37%] Building CXX object tests/CMakeFiles/UnitTestsLib.dir/UnitTests/TestDatabaseBlockc                                                       hainCache.cpp.o
cc1plus: error: invalid option argument ‘-Ofast’
cc1plus: error: -Werror=unused-result: No option -Wunused-result
cc1plus: error: -Werror=maybe-uninitialized: No option -Wmaybe-uninitialized
cc1plus: error: unrecognized command line option "-std=c++11"
make[3]: *** [tests/CMakeFiles/UnitTestsLib.dir/UnitTests/TestDatabaseBlockchainCache.cpp                                                       .o] Error 1
[ 37%] Building CXX object tests/CMakeFiles/UnitTestsLib.dir/UnitTests/TestTransfersSubsc                                                       ription.cpp.o
cc1plus: error: invalid option argument ‘-Ofast’
cc1plus: error: -Werror=unused-result: No option -Wunused-result
cc1plus: error: -Werror=maybe-uninitialized: No option -Wmaybe-uninitialized
cc1plus: error: unrecognized command line option "-std=c++11"
make[3]: *** [tests/CMakeFiles/UnitTestsLib.dir/UnitTests/TestTransfersSubscription.cpp.o                                                       ] Error 1
[ 37%] Building CXX object tests/CMakeFiles/UnitTestsLib.dir/UnitTests/MulDiv.cpp.o
cc1plus: error: invalid option argument ‘-Ofast’
cc1plus: error: -Werror=unused-result: No option -Wunused-result
cc1plus: error: -Werror=maybe-uninitialized: No option -Wmaybe-uninitialized
cc1plus: error: unrecognized command line option "-std=c++11"
make[3]: *** [tests/CMakeFiles/UnitTestsLib.dir/UnitTests/MulDiv.cpp.o] Error 1
[ 37%] Building CXX object tests/CMakeFiles/UnitTestsLib.dir/UnitTests/ArrayViewTests.cpp                                                       .o
cc1plus: error: invalid option argument ‘-Ofast’
cc1plus: error: -Werror=unused-result: No option -Wunused-result
cc1plus: error: -Werror=maybe-uninitialized: No option -Wmaybe-uninitialized
cc1plus: error: unrecognized command line option "-std=c++11"
make[3]: *** [tests/CMakeFiles/UnitTestsLib.dir/UnitTests/ArrayViewTests.cpp.o] Error 1
[ 38%] Building CXX object tests/CMakeFiles/UnitTestsLib.dir/UnitTests/BlockingQueue.cpp.                                                       o
cc1plus: error: invalid option argument ‘-Ofast’
cc1plus: error: -Werror=unused-result: No option -Wunused-result
cc1plus: error: -Werror=maybe-uninitialized: No option -Wmaybe-uninitialized
cc1plus: error: unrecognized command line option "-std=c++11"
make[3]: *** [tests/CMakeFiles/UnitTestsLib.dir/UnitTests/BlockingQueue.cpp.o] Error 1
[ 38%] Building CXX object tests/CMakeFiles/UnitTestsLib.dir/UnitTests/TransactionApi.cpp                                                       .o
cc1plus: error: invalid option argument ‘-Ofast’
cc1plus: error: -Werror=unused-result: No option -Wunused-result
cc1plus: error: -Werror=maybe-uninitialized: No option -Wmaybe-uninitialized
cc1plus: error: unrecognized command line option "-std=c++11"
make[3]: *** [tests/CMakeFiles/UnitTestsLib.dir/UnitTests/TransactionApi.cpp.o] Error 1
[ 38%] Building CXX object tests/CMakeFiles/UnitTestsLib.dir/UnitTests/TestBlockchainStor                                                       age.cpp.o
cc1plus: error: invalid option argument ‘-Ofast’
cc1plus: error: -Werror=unused-result: No option -Wunused-result
cc1plus: error: -Werror=maybe-uninitialized: No option -Wmaybe-uninitialized
cc1plus: error: unrecognized command line option "-std=c++11"
make[3]: *** [tests/CMakeFiles/UnitTestsLib.dir/UnitTests/TestBlockchainStorage.cpp.o] Er                                                       ror 1
[ 39%] Building CXX object tests/CMakeFiles/UnitTestsLib.dir/UnitTests/TestInprocessNode.                                                       cpp.o
cc1plus: error: invalid option argument ‘-Ofast’
cc1plus: error: -Werror=unused-result: No option -Wunused-result
cc1plus: error: -Werror=maybe-uninitialized: No option -Wmaybe-uninitialized
cc1plus: error: unrecognized command line option "-std=c++11"
make[3]: *** [tests/CMakeFiles/UnitTestsLib.dir/UnitTests/TestInprocessNode.cpp.o] Error                                                        1
[ 39%] Building CXX object tests/CMakeFiles/UnitTestsLib.dir/UnitTests/TestTransfersConta                                                       iner.cpp.o
cc1plus: error: invalid option argument ‘-Ofast’
cc1plus: error: -Werror=unused-result: No option -Wunused-result
cc1plus: error: -Werror=maybe-uninitialized: No option -Wmaybe-uninitialized
cc1plus: error: unrecognized command line option "-std=c++11"
make[3]: *** [tests/CMakeFiles/UnitTestsLib.dir/UnitTests/TestTransfersContainer.cpp.o] E                                                       rror 1
[ 39%] Building CXX object tests/CMakeFiles/UnitTestsLib.dir/UnitTests/TestBlockchainExpl                                                       orer.cpp.o
cc1plus: error: invalid option argument ‘-Ofast’
cc1plus: error: -Werror=unused-result: No option -Wunused-result
cc1plus: error: -Werror=maybe-uninitialized: No option -Wmaybe-uninitialized
cc1plus: error: unrecognized command line option "-std=c++11"
make[3]: *** [tests/CMakeFiles/UnitTestsLib.dir/UnitTests/TestBlockchainExplorer.cpp.o] E                                                       rror 1
[ 39%] Building CXX object tests/CMakeFiles/UnitTestsLib.dir/UnitTests/DataBaseMock.cpp.o
cc1plus: error: invalid option argument ‘-Ofast’
cc1plus: error: -Werror=unused-result: No option -Wunused-result
cc1plus: error: -Werror=maybe-uninitialized: No option -Wmaybe-uninitialized
cc1plus: error: unrecognized command line option "-std=c++11"
make[3]: *** [tests/CMakeFiles/UnitTestsLib.dir/UnitTests/DataBaseMock.cpp.o] Error 1
[ 40%] Building CXX object tests/CMakeFiles/UnitTestsLib.dir/UnitTests/TestFileMappedVect                                                       or.cpp.o
cc1plus: error: invalid option argument ‘-Ofast’
cc1plus: error: -Werror=unused-result: No option -Wunused-result
cc1plus: error: -Werror=maybe-uninitialized: No option -Wmaybe-uninitialized
cc1plus: error: unrecognized command line option "-std=c++11"
make[3]: *** [tests/CMakeFiles/UnitTestsLib.dir/UnitTests/TestFileMappedVector.cpp.o] Err                                                       or 1
[ 40%] Building CXX object tests/CMakeFiles/UnitTestsLib.dir/UnitTests/Serialization.cpp.                                                       o
cc1plus: error: invalid option argument ‘-Ofast’
cc1plus: error: -Werror=unused-result: No option -Wunused-result
cc1plus: error: -Werror=maybe-uninitialized: No option -Wmaybe-uninitialized
cc1plus: error: unrecognized command line option "-std=c++11"
make[3]: *** [tests/CMakeFiles/UnitTestsLib.dir/UnitTests/Serialization.cpp.o] Error 1
[ 40%] Building CXX object tests/CMakeFiles/UnitTestsLib.dir/UnitTests/ICoreStub.cpp.o
cc1plus: error: invalid option argument ‘-Ofast’
cc1plus: error: -Werror=unused-result: No option -Wunused-result
cc1plus: error: -Werror=maybe-uninitialized: No option -Wmaybe-uninitialized
cc1plus: error: unrecognized command line option "-std=c++11"
make[3]: *** [tests/CMakeFiles/UnitTestsLib.dir/UnitTests/ICoreStub.cpp.o] Error 1
[ 40%] Building CXX object tests/CMakeFiles/UnitTestsLib.dir/UnitTests/TestCurrency.cpp.o
cc1plus: error: invalid option argument ‘-Ofast’
cc1plus: error: -Werror=unused-result: No option -Wunused-result
cc1plus: error: -Werror=maybe-uninitialized: No option -Wmaybe-uninitialized
cc1plus: error: unrecognized command line option "-std=c++11"
make[3]: *** [tests/CMakeFiles/UnitTestsLib.dir/UnitTests/TestCurrency.cpp.o] Error 1
[ 41%] Building CXX object tests/CMakeFiles/UnitTestsLib.dir/UnitTests/ParseAmount.cpp.o
cc1plus: error: invalid option argument ‘-Ofast’
cc1plus: error: -Werror=unused-result: No option -Wunused-result
cc1plus: error: -Werror=maybe-uninitialized: No option -Wmaybe-uninitialized
cc1plus: error: unrecognized command line option "-std=c++11"
make[3]: *** [tests/CMakeFiles/UnitTestsLib.dir/UnitTests/ParseAmount.cpp.o] Error 1
[ 41%] Building CXX object tests/CMakeFiles/UnitTestsLib.dir/UnitTests/TestBlockchainGene                                                       rator.cpp.o
cc1plus: error: invalid option argument ‘-Ofast’
cc1plus: error: -Werror=unused-result: No option -Wunused-result
cc1plus: error: -Werror=maybe-uninitialized: No option -Wmaybe-uninitialized
cc1plus: error: unrecognized command line option "-std=c++11"
make[3]: *** [tests/CMakeFiles/UnitTestsLib.dir/UnitTests/TestBlockchainGenerator.cpp.o]                                                        Error 1
[ 41%] Building CXX object tests/CMakeFiles/UnitTestsLib.dir/UnitTests/TestWalletLegacy.c                                                       pp.o
cc1plus: error: invalid option argument ‘-Ofast’
cc1plus: error: -Werror=unused-result: No option -Wunused-result
cc1plus: error: -Werror=maybe-uninitialized: No option -Wmaybe-uninitialized
cc1plus: error: unrecognized command line option "-std=c++11"
make[3]: *** [tests/CMakeFiles/UnitTestsLib.dir/UnitTests/TestWalletLegacy.cpp.o] Error 1
[ 41%] Building CXX object tests/CMakeFiles/UnitTestsLib.dir/UnitTests/ICryptoNoteProtoco                                                       lQueryStub.cpp.o
cc1plus: error: invalid option argument ‘-Ofast’
cc1plus: error: -Werror=unused-result: No option -Wunused-result
cc1plus: error: -Werror=maybe-uninitialized: No option -Wmaybe-uninitialized
cc1plus: error: unrecognized command line option "-std=c++11"
make[3]: *** [tests/CMakeFiles/UnitTestsLib.dir/UnitTests/ICryptoNoteProtocolQueryStub.cp                                                       p.o] Error 1
[ 42%] Building CXX object tests/CMakeFiles/UnitTestsLib.dir/UnitTests/INodeStubs.cpp.o
cc1plus: error: invalid option argument ‘-Ofast’
cc1plus: error: -Werror=unused-result: No option -Wunused-result
cc1plus: error: -Werror=maybe-uninitialized: No option -Wmaybe-uninitialized
cc1plus: error: unrecognized command line option "-std=c++11"
make[3]: *** [tests/CMakeFiles/UnitTestsLib.dir/UnitTests/INodeStubs.cpp.o] Error 1
[ 42%] Building CXX object tests/CMakeFiles/UnitTestsLib.dir/UnitTests/StringBufferTests.                                                       cpp.o
cc1plus: error: invalid option argument ‘-Ofast’
cc1plus: error: -Werror=unused-result: No option -Wunused-result
cc1plus: error: -Werror=maybe-uninitialized: No option -Wmaybe-uninitialized
cc1plus: error: unrecognized command line option "-std=c++11"
make[3]: *** [tests/CMakeFiles/UnitTestsLib.dir/UnitTests/StringBufferTests.cpp.o] Error                                                        1
[ 42%] Building CXX object tests/CMakeFiles/UnitTestsLib.dir/UnitTests/TestBcS.cpp.o
cc1plus: error: invalid option argument ‘-Ofast’
cc1plus: error: -Werror=unused-result: No option -Wunused-result
cc1plus: error: -Werror=maybe-uninitialized: No option -Wmaybe-uninitialized
cc1plus: error: unrecognized command line option "-std=c++11"
make[3]: *** [tests/CMakeFiles/UnitTestsLib.dir/UnitTests/TestBcS.cpp.o] Error 1
[ 43%] Building CXX object tests/CMakeFiles/UnitTestsLib.dir/UnitTests/TestWalletService.                                                       cpp.o
cc1plus: error: invalid option argument ‘-Ofast’
cc1plus: error: -Werror=unused-result: No option -Wunused-result
cc1plus: error: -Werror=maybe-uninitialized: No option -Wmaybe-uninitialized
cc1plus: error: unrecognized command line option "-std=c++11"
make[3]: *** [tests/CMakeFiles/UnitTestsLib.dir/UnitTests/TestWalletService.cpp.o] Error                                                        1
[ 43%] Building CXX object tests/CMakeFiles/UnitTestsLib.dir/UnitTests/TestWallet.cpp.o
cc1plus: error: invalid option argument ‘-Ofast’
cc1plus: error: -Werror=unused-result: No option -Wunused-result
cc1plus: error: -Werror=maybe-uninitialized: No option -Wmaybe-uninitialized
cc1plus: error: unrecognized command line option "-std=c++11"
make[3]: *** [tests/CMakeFiles/UnitTestsLib.dir/UnitTests/TestWallet.cpp.o] Error 1
[ 43%] Building CXX object tests/CMakeFiles/UnitTestsLib.dir/UnitTests/BlockReward.cpp.o
cc1plus: error: invalid option argument ‘-Ofast’
cc1plus: error: -Werror=unused-result: No option -Wunused-result
cc1plus: error: -Werror=maybe-uninitialized: No option -Wmaybe-uninitialized
cc1plus: error: unrecognized command line option "-std=c++11"
make[3]: *** [tests/CMakeFiles/UnitTestsLib.dir/UnitTests/BlockReward.cpp.o] Error 1
[ 43%] Building CXX object tests/CMakeFiles/UnitTestsLib.dir/UnitTests/StringViewTests.cp                                                       p.o
cc1plus: error: invalid option argument ‘-Ofast’
cc1plus: error: -Werror=unused-result: No option -Wunused-result
cc1plus: error: -Werror=maybe-uninitialized: No option -Wmaybe-uninitialized
cc1plus: error: unrecognized command line option "-std=c++11"
make[3]: *** [tests/CMakeFiles/UnitTestsLib.dir/UnitTests/StringViewTests.cpp.o] Error 1
[ 44%] Building CXX object tests/CMakeFiles/UnitTestsLib.dir/UnitTests/TestMessageQueue.c                                                       pp.o
cc1plus: error: invalid option argument ‘-Ofast’
cc1plus: error: -Werror=unused-result: No option -Wunused-result
cc1plus: error: -Werror=maybe-uninitialized: No option -Wmaybe-uninitialized
cc1plus: error: unrecognized command line option "-std=c++11"
make[3]: *** [tests/CMakeFiles/UnitTestsLib.dir/UnitTests/TestMessageQueue.cpp.o] Error 1
[ 44%] Building CXX object tests/CMakeFiles/UnitTestsLib.dir/UnitTests/Chacha8.cpp.o
cc1plus: error: invalid option argument ‘-Ofast’
cc1plus: error: -Werror=unused-result: No option -Wunused-result
cc1plus: error: -Werror=maybe-uninitialized: No option -Wmaybe-uninitialized
cc1plus: error: unrecognized command line option "-std=c++11"
make[3]: *** [tests/CMakeFiles/UnitTestsLib.dir/UnitTests/Chacha8.cpp.o] Error 1
[ 44%] Building CXX object tests/CMakeFiles/UnitTestsLib.dir/UnitTests/TestPath.cpp.o
cc1plus: error: invalid option argument ‘-Ofast’
cc1plus: error: -Werror=unused-result: No option -Wunused-result
cc1plus: error: -Werror=maybe-uninitialized: No option -Wmaybe-uninitialized
cc1plus: error: unrecognized command line option "-std=c++11"
make[3]: *** [tests/CMakeFiles/UnitTestsLib.dir/UnitTests/TestPath.cpp.o] Error 1
[ 44%] Building CXX object tests/CMakeFiles/UnitTestsLib.dir/UnitTests/SerializationKV.cp                                                       p.o
cc1plus: error: invalid option argument ‘-Ofast’
cc1plus: error: -Werror=unused-result: No option -Wunused-result
cc1plus: error: -Werror=maybe-uninitialized: No option -Wmaybe-uninitialized
cc1plus: error: unrecognized command line option "-std=c++11"
make[3]: *** [tests/CMakeFiles/UnitTestsLib.dir/UnitTests/SerializationKV.cpp.o] Error 1
[ 45%] Building CXX object tests/CMakeFiles/UnitTestsLib.dir/UnitTests/Checkpoints.cpp.o
cc1plus: error: invalid option argument ‘-Ofast’
cc1plus: error: -Werror=unused-result: No option -Wunused-result
cc1plus: error: -Werror=maybe-uninitialized: No option -Wmaybe-uninitialized
cc1plus: error: unrecognized command line option "-std=c++11"
make[3]: *** [tests/CMakeFiles/UnitTestsLib.dir/UnitTests/Checkpoints.cpp.o] Error 1
[ 45%] Building CXX object tests/CMakeFiles/UnitTestsLib.dir/UnitTests/TestTransfersConsu                                                       mer.cpp.o
cc1plus: error: invalid option argument ‘-Ofast’
cc1plus: error: -Werror=unused-result: No option -Wunused-result
cc1plus: error: -Werror=maybe-uninitialized: No option -Wmaybe-uninitialized
cc1plus: error: unrecognized command line option "-std=c++11"
make[3]: *** [tests/CMakeFiles/UnitTestsLib.dir/UnitTests/TestTransfersConsumer.cpp.o] Er                                                       ror 1
[ 45%] Building CXX object tests/CMakeFiles/UnitTestsLib.dir/UnitTests/TestBlockchainCach                                                       e.cpp.o
cc1plus: error: invalid option argument ‘-Ofast’
cc1plus: error: -Werror=unused-result: No option -Wunused-result
cc1plus: error: -Werror=maybe-uninitialized: No option -Wmaybe-uninitialized
cc1plus: error: unrecognized command line option "-std=c++11"
make[3]: *** [tests/CMakeFiles/UnitTestsLib.dir/UnitTests/TestBlockchainCache.cpp.o] Erro                                                       r 1
[ 46%] Building CXX object tests/CMakeFiles/UnitTestsLib.dir/UnitTests/Shuffle.cpp.o
cc1plus: error: invalid option argument ‘-Ofast’
cc1plus: error: -Werror=unused-result: No option -Wunused-result
cc1plus: error: -Werror=maybe-uninitialized: No option -Wmaybe-uninitialized
cc1plus: error: unrecognized command line option "-std=c++11"
make[3]: *** [tests/CMakeFiles/UnitTestsLib.dir/UnitTests/Shuffle.cpp.o] Error 1
[ 46%] Building CXX object tests/CMakeFiles/UnitTestsLib.dir/UnitTests/main.cpp.o
cc1plus: error: invalid option argument ‘-Ofast’
cc1plus: error: -Werror=unused-result: No option -Wunused-result
cc1plus: error: -Werror=maybe-uninitialized: No option -Wmaybe-uninitialized
cc1plus: error: unrecognized command line option "-std=c++11"
make[3]: *** [tests/CMakeFiles/UnitTestsLib.dir/UnitTests/main.cpp.o] Error 1
[ 46%] Building CXX object tests/CMakeFiles/UnitTestsLib.dir/UnitTests/TestUpgradeDetecto                                                       r.cpp.o
cc1plus: error: invalid option argument ‘-Ofast’
cc1plus: error: -Werror=unused-result: No option -Wunused-result
cc1plus: error: -Werror=maybe-uninitialized: No option -Wmaybe-uninitialized
cc1plus: error: unrecognized command line option "-std=c++11"
make[3]: *** [tests/CMakeFiles/UnitTestsLib.dir/UnitTests/TestUpgradeDetector.cpp.o] Erro                                                       r 1
[ 46%] Building CXX object tests/CMakeFiles/UnitTestsLib.dir/UnitTests/TestTransactionPoo                                                       lDetach.cpp.o
cc1plus: error: invalid option argument ‘-Ofast’
cc1plus: error: -Werror=unused-result: No option -Wunused-result
cc1plus: error: -Werror=maybe-uninitialized: No option -Wmaybe-uninitialized
cc1plus: error: unrecognized command line option "-std=c++11"
make[3]: *** [tests/CMakeFiles/UnitTestsLib.dir/UnitTests/TestTransactionPoolDetach.cpp.o                                                       ] Error 1
[ 47%] Building CXX object tests/CMakeFiles/UnitTestsLib.dir/UnitTests/TransactionPool.cp                                                       p.o
cc1plus: error: invalid option argument ‘-Ofast’
cc1plus: error: -Werror=unused-result: No option -Wunused-result
cc1plus: error: -Werror=maybe-uninitialized: No option -Wmaybe-uninitialized
cc1plus: error: unrecognized command line option "-std=c++11"
make[3]: *** [tests/CMakeFiles/UnitTestsLib.dir/UnitTests/TransactionPool.cpp.o] Error 1
[ 47%] Building CXX object tests/CMakeFiles/UnitTestsLib.dir/UnitTests/ArrayRefTests.cpp.                                                       o
cc1plus: error: invalid option argument ‘-Ofast’
cc1plus: error: -Werror=unused-result: No option -Wunused-result
cc1plus: error: -Werror=maybe-uninitialized: No option -Wmaybe-uninitialized
cc1plus: error: unrecognized command line option "-std=c++11"
make[3]: *** [tests/CMakeFiles/UnitTestsLib.dir/UnitTests/ArrayRefTests.cpp.o] Error 1
[ 47%] Building CXX object tests/CMakeFiles/UnitTestsLib.dir/UnitTests/TestFormatUtils.cp                                                       p.o
cc1plus: error: invalid option argument ‘-Ofast’
cc1plus: error: -Werror=unused-result: No option -Wunused-result
cc1plus: error: -Werror=maybe-uninitialized: No option -Wmaybe-uninitialized
cc1plus: error: unrecognized command line option "-std=c++11"
make[3]: *** [tests/CMakeFiles/UnitTestsLib.dir/UnitTests/TestFormatUtils.cpp.o] Error 1
make[3]: Target `tests/CMakeFiles/UnitTestsLib.dir/build' not remade because of errors.
make[3]: Leaving directory `/var/git/dollarydoos/build/release'
make[2]: *** [tests/CMakeFiles/UnitTestsLib.dir/all] Error 2
make[3]: Entering directory `/var/git/dollarydoos/build/release'
Scanning dependencies of target TestGenerator
make[3]: Leaving directory `/var/git/dollarydoos/build/release'
make[3]: Entering directory `/var/git/dollarydoos/build/release'
[ 47%] Building CXX object tests/CMakeFiles/TestGenerator.dir/TestGenerator/TestGenerator                                                       .cpp.o
cc1plus: error: invalid option argument ‘-Ofast’
cc1plus: error: -Werror=unused-result: No option -Wunused-result
cc1plus: error: -Werror=maybe-uninitialized: No option -Wmaybe-uninitialized
cc1plus: error: unrecognized command line option "-std=c++11"
make[3]: *** [tests/CMakeFiles/TestGenerator.dir/TestGenerator/TestGenerator.cpp.o] Error                                                        1
make[3]: Target `tests/CMakeFiles/TestGenerator.dir/build' not remade because of errors.
make[3]: Leaving directory `/var/git/dollarydoos/build/release'
make[2]: *** [tests/CMakeFiles/TestGenerator.dir/all] Error 2
make[3]: Entering directory `/var/git/dollarydoos/build/release'
Scanning dependencies of target TestsCommon
make[3]: Leaving directory `/var/git/dollarydoos/build/release'
make[3]: Entering directory `/var/git/dollarydoos/build/release'
[ 47%] Building CXX object tests/CMakeFiles/TestsCommon.dir/Common/VectorMainChainStorage                                                       .cpp.o
cc1plus: error: invalid option argument ‘-Ofast’
cc1plus: error: -Werror=unused-result: No option -Wunused-result
cc1plus: error: -Werror=maybe-uninitialized: No option -Wmaybe-uninitialized
cc1plus: error: unrecognized command line option "-std=c++11"
make[3]: *** [tests/CMakeFiles/TestsCommon.dir/Common/VectorMainChainStorage.cpp.o] Error                                                        1
make[3]: Target `tests/CMakeFiles/TestsCommon.dir/build' not remade because of errors.
make[3]: Leaving directory `/var/git/dollarydoos/build/release'
make[2]: *** [tests/CMakeFiles/TestsCommon.dir/all] Error 2
make[3]: Entering directory `/var/git/dollarydoos/build/release'
Scanning dependencies of target CryptoTests
make[3]: Leaving directory `/var/git/dollarydoos/build/release'
make[3]: Entering directory `/var/git/dollarydoos/build/release'
[ 47%] Building C object tests/CMakeFiles/CryptoTests.dir/crypto/hash.c.o
cc1: error: invalid option argument ‘-Ofast’
cc1: error: -Werror=unused-result: No option -Wunused-result
cc1: error: -Werror=maybe-uninitialized: No option -Wmaybe-uninitialized
cc1: error: unrecognized command line option "-std=c11"
make[3]: *** [tests/CMakeFiles/CryptoTests.dir/crypto/hash.c.o] Error 1
[ 47%] Building C object tests/CMakeFiles/CryptoTests.dir/crypto/crypto-ops.c.o
cc1: error: invalid option argument ‘-Ofast’
cc1: error: -Werror=unused-result: No option -Wunused-result
cc1: error: -Werror=maybe-uninitialized: No option -Wmaybe-uninitialized
cc1: error: unrecognized command line option "-std=c11"
make[3]: *** [tests/CMakeFiles/CryptoTests.dir/crypto/crypto-ops.c.o] Error 1
[ 48%] Building C object tests/CMakeFiles/CryptoTests.dir/crypto/random.c.o
cc1: error: invalid option argument ‘-Ofast’
cc1: error: -Werror=unused-result: No option -Wunused-result
cc1: error: -Werror=maybe-uninitialized: No option -Wmaybe-uninitialized
cc1: error: unrecognized command line option "-std=c11"
make[3]: *** [tests/CMakeFiles/CryptoTests.dir/crypto/random.c.o] Error 1
[ 48%] Building C object tests/CMakeFiles/CryptoTests.dir/crypto/crypto-ops-data.c.o
cc1: error: invalid option argument ‘-Ofast’
cc1: error: -Werror=unused-result: No option -Wunused-result
cc1: error: -Werror=maybe-uninitialized: No option -Wmaybe-uninitialized
cc1: error: unrecognized command line option "-std=c11"
make[3]: *** [tests/CMakeFiles/CryptoTests.dir/crypto/crypto-ops-data.c.o] Error 1
[ 48%] Building CXX object tests/CMakeFiles/CryptoTests.dir/crypto/crypto.cpp.o
cc1plus: error: invalid option argument ‘-Ofast’
cc1plus: error: -Werror=unused-result: No option -Wunused-result
cc1plus: error: -Werror=maybe-uninitialized: No option -Wmaybe-uninitialized
cc1plus: error: unrecognized command line option "-std=c++11"
make[3]: *** [tests/CMakeFiles/CryptoTests.dir/crypto/crypto.cpp.o] Error 1
[ 48%] Building CXX object tests/CMakeFiles/CryptoTests.dir/crypto/main.cpp.o
cc1plus: error: invalid option argument ‘-Ofast’
cc1plus: error: -Werror=unused-result: No option -Wunused-result
cc1plus: error: -Werror=maybe-uninitialized: No option -Wmaybe-uninitialized
cc1plus: error: unrecognized command line option "-std=c++11"
make[3]: *** [tests/CMakeFiles/CryptoTests.dir/crypto/main.cpp.o] Error 1
make[3]: Target `tests/CMakeFiles/CryptoTests.dir/build' not remade because of errors.
make[3]: Leaving directory `/var/git/dollarydoos/build/release'
make[2]: *** [tests/CMakeFiles/CryptoTests.dir/all] Error 2
make[3]: Entering directory `/var/git/dollarydoos/build/release'
Scanning dependencies of target IntegrationTestLibrary
make[3]: Leaving directory `/var/git/dollarydoos/build/release'
make[3]: Entering directory `/var/git/dollarydoos/build/release'
[ 49%] Building CXX object tests/CMakeFiles/IntegrationTestLibrary.dir/IntegrationTestLib                                                       /TestWalletLegacy.cpp.o
cc1plus: error: invalid option argument ‘-Ofast’
cc1plus: error: -Werror=unused-result: No option -Wunused-result
cc1plus: error: -Werror=maybe-uninitialized: No option -Wmaybe-uninitialized
cc1plus: error: unrecognized command line option "-std=c++11"
make[3]: *** [tests/CMakeFiles/IntegrationTestLibrary.dir/IntegrationTestLib/TestWalletLe                                                       gacy.cpp.o] Error 1
[ 49%] Building CXX object tests/CMakeFiles/IntegrationTestLibrary.dir/IntegrationTestLib                                                       /RPCTestNode.cpp.o
cc1plus: error: invalid option argument ‘-Ofast’
cc1plus: error: -Werror=unused-result: No option -Wunused-result
cc1plus: error: -Werror=maybe-uninitialized: No option -Wmaybe-uninitialized
cc1plus: error: unrecognized command line option "-std=c++11"
make[3]: *** [tests/CMakeFiles/IntegrationTestLibrary.dir/IntegrationTestLib/RPCTestNode.                                                       cpp.o] Error 1
[ 49%] Building CXX object tests/CMakeFiles/IntegrationTestLibrary.dir/IntegrationTestLib                                                       /Logger.cpp.o
cc1plus: error: invalid option argument ‘-Ofast’
cc1plus: error: -Werror=unused-result: No option -Wunused-result
cc1plus: error: -Werror=maybe-uninitialized: No option -Wmaybe-uninitialized
cc1plus: error: unrecognized command line option "-std=c++11"
make[3]: *** [tests/CMakeFiles/IntegrationTestLibrary.dir/IntegrationTestLib/Logger.cpp.o                                                       ] Error 1
[ 50%] Building CXX object tests/CMakeFiles/IntegrationTestLibrary.dir/IntegrationTestLib                                                       /BaseFunctionalTests.cpp.o
cc1plus: error: invalid option argument ‘-Ofast’
cc1plus: error: -Werror=unused-result: No option -Wunused-result
cc1plus: error: -Werror=maybe-uninitialized: No option -Wmaybe-uninitialized
cc1plus: error: unrecognized command line option "-std=c++11"
make[3]: *** [tests/CMakeFiles/IntegrationTestLibrary.dir/IntegrationTestLib/BaseFunction                                                       alTests.cpp.o] Error 1
[ 50%] Building CXX object tests/CMakeFiles/IntegrationTestLibrary.dir/IntegrationTestLib                                                       /InProcTestNode.cpp.o
cc1plus: error: invalid option argument ‘-Ofast’
cc1plus: error: -Werror=unused-result: No option -Wunused-result
cc1plus: error: -Werror=maybe-uninitialized: No option -Wmaybe-uninitialized
cc1plus: error: unrecognized command line option "-std=c++11"
make[3]: *** [tests/CMakeFiles/IntegrationTestLibrary.dir/IntegrationTestLib/InProcTestNo                                                       de.cpp.o] Error 1
[ 50%] Building CXX object tests/CMakeFiles/IntegrationTestLibrary.dir/IntegrationTestLib                                                       /Process.cpp.o
cc1plus: error: invalid option argument ‘-Ofast’
cc1plus: error: -Werror=unused-result: No option -Wunused-result
cc1plus: error: -Werror=maybe-uninitialized: No option -Wmaybe-uninitialized
cc1plus: error: unrecognized command line option "-std=c++11"
make[3]: *** [tests/CMakeFiles/IntegrationTestLibrary.dir/IntegrationTestLib/Process.cpp.                                                       o] Error 1
[ 50%] Building CXX object tests/CMakeFiles/IntegrationTestLibrary.dir/IntegrationTestLib                                                       /TestNetwork.cpp.o
cc1plus: error: invalid option argument ‘-Ofast’
cc1plus: error: -Werror=unused-result: No option -Wunused-result
cc1plus: error: -Werror=maybe-uninitialized: No option -Wmaybe-uninitialized
cc1plus: error: unrecognized command line option "-std=c++11"
make[3]: *** [tests/CMakeFiles/IntegrationTestLibrary.dir/IntegrationTestLib/TestNetwork.                                                       cpp.o] Error 1
make[3]: Target `tests/CMakeFiles/IntegrationTestLibrary.dir/build' not remade because of                                                        errors.
make[3]: Leaving directory `/var/git/dollarydoos/build/release'
make[2]: *** [tests/CMakeFiles/IntegrationTestLibrary.dir/all] Error 2
make[2]: Target `all' not remade because of errors.
make[2]: Leaving directory `/var/git/dollarydoos/build/release'
make[1]: *** [all] Error 2
make[1]: Target `default_target' not remade because of errors.
make[1]: Leaving directory `/var/git/dollarydoos/build/release'
make: *** [build-release] Error 2
make: Target `all' not remade because of errors.

Comments

  •  icon
    01/01/70 12:00:00 AM UTC
    Plain Text |

    0 B

    |

    👍

    /

    👎

    
        
  •  icon
    01/01/70 12:00:00 AM UTC
    Plain Text |

    0 B

    |

    👍

    /

    👎