Create started: 2:47:41 AM "D:\SteamLibrary\steamapps\common\gamemaker_studio\GMAssetCompiler.exe" /fU="C:\Tryhard\gm_ttt_62844\a66881.txt" /c /m=android /config="Default" /tgt=8 /obob=True /obpp=False /obru=True /obes=False /i=3 /cvm /tp=1024 /mv=1 /iv=0 /rv=0 /bv=1757 /gn="DT" /td="C:\Tryhard" /cd="C:\G" /sh=True /dbgp="6502" /hip="192.168.0.5" /hprt="51268" /optionsini="C:\Tryhard\gm_ttt_62844\gm_ttt_73254\DT.ini" /o="C:\Tryhard\gm_ttt_62844\gm_ttt_73254" "C:\DT\DT.gmx\DT.project.gmx" Reading project file....finished. Compile Constants...finished. Remove DnD...finished. Compile Scripts...finished. Compile Objects...finished. Compile Timelines...finished. Compile Triggers...finished. Compile Rooms...finished. Compile Extensions...finished. Final Compile...finished. Saving IFF file... C:\Tryhard\gm_ttt_62844\gm_ttt_73254\DT.droid Writing Chunk... GEN8 Writing Chunk... OPTN Writing Chunk... EXTN Writing Chunk... SOND Converting snd_btn_over to Wav 16bit mono @ 44100Hz Converting snd_btn_press to Wav 16bit mono @ 44100Hz Converting fart to Wav 16bit mono @ 44100Hz Converting fart2 to Wav 16bit mono @ 44100Hz Converting fart3 to Wav 16bit mono @ 44100Hz Converting fart4 to Wav 16bit mono @ 44100Hz Converting fart5 to Wav 16bit mono @ 44100Hz Converting fart6 to Wav 16bit mono @ 44100Hz Converting fart7 to Wav 16bit mono @ 44100Hz Converting fart8 to Wav 16bit mono @ 44100Hz Converting fart9 to Wav 16bit mono @ 44100Hz Converting fart10 to Wav 16bit mono @ 44100Hz Converting ghostfart to Wav 16bit mono @ 44100Hz Converting fartmaster to Wav 16bit mono @ 44100Hz Converting fartmaster2 to Wav 16bit mono @ 44100Hz Converting fartmaster3 to Wav 16bit mono @ 44100Hz Converting fartmaster4 to Wav 16bit mono @ 44100Hz Converting fartmaster5 to Wav 16bit mono @ 44100Hz Converting trump to Wav 16bit mono @ 44100Hz Converting trump2 to Wav 16bit mono @ 44100Hz Converting trump3 to Wav 16bit mono @ 44100Hz Converting trump4 to Wav 16bit mono @ 44100Hz Converting trump5 to Wav 16bit mono @ 44100Hz Converting trump6 to Wav 16bit mono @ 44100Hz Converting trump7 to Wav 16bit mono @ 44100Hz Converting trump8 to Wav 16bit mono @ 44100Hz Converting trump9 to Wav 16bit mono @ 44100Hz Converting trump10 to Wav 16bit mono @ 44100Hz Converting trump11 to Wav 16bit mono @ 44100Hz Converting trump12 to Wav 16bit mono @ 44100Hz Converting trump13 to Wav 16bit mono @ 44100Hz Converting trump14 to Wav 16bit mono @ 44100Hz Converting trump15 to Wav 16bit mono @ 44100Hz Converting sndhit to Wav 16bit mono @ 44100Hz Converting sndhit2 to Wav 16bit mono @ 44100Hz Converting sndhit3 to Wav 16bit mono @ 44100Hz Writing Chunk... AGRP Writing Chunk... SPRT Writing Chunk... BGND Warning : resource bg_main_0 rescaled from 720,1280 to 360,640 Writing Chunk... PATH Writing Chunk... SCPT Writing Chunk... SHDR Writing Chunk... FONT Writing Chunk... TMLN Writing Chunk... OBJT Writing Chunk... ROOM Writing Chunk... DAFL Writing Chunk... TPAGE Writing Chunk... CODE Writing Chunk... VARI Writing Chunk... FUNC Writing Chunk... STRG Writing Chunk... TXTR 0 Compressing texture... writing texture texture_0.png... 1 Compressing texture... writing texture texture_1.png... 2 Compressing texture... writing texture texture_2.png... 3 Compressing texture... writing texture texture_3.png... 4 Compressing texture... writing texture texture_4.png... Writing Chunk... AUDO Writing Chunk... SCPT Writing Chunk... DBGI Writing Chunk... INST Writing Chunk... LOCL Writing Chunk... STRG Stats : GMA : Elapsed=8415.7301 Stats : GMA : sp=19,au=36,bk=1,pt=0,sc=367,sh=0,fo=2,tl=0,ob=25,ro=3,da=2,ex=7,ma=14,fm=0x1A6D0B20 cmd /c ""D:\SteamLibrary\steamapps\common\gamemaker_studio\Android\runner\gradle\gradlew"" build -x assembleDebug :com.companyname.GMProjectTemplate:preBuild UP-TO-DATE :com.companyname.GMProjectTemplate:preReleaseBuild UP-TO-DATE :com.companyname.GMProjectTemplate:checkReleaseManifest :com.companyname.GMProjectTemplate:preDebugBuild UP-TO-DATE :google-play-services_lib:compileLint :google-play-services_lib:copyReleaseLint UP-TO-DATE :google-play-services_lib:mergeReleaseProguardFiles :google-play-services_lib:preBuild UP-TO-DATE :google-play-services_lib:preReleaseBuild UP-TO-DATE :google-play-services_lib:checkReleaseManifest :google-play-services_lib:prepareReleaseDependencies :google-play-services_lib:compileReleaseAidl :google-play-services_lib:compileReleaseRenderscript :google-play-services_lib:generateReleaseBuildConfig :google-play-services_lib:generateReleaseAssets UP-TO-DATE :google-play-services_lib:mergeReleaseAssets :google-play-services_lib:generateReleaseResValues :google-play-services_lib:generateReleaseResources :google-play-services_lib:packageReleaseResources :google-play-services_lib:processReleaseManifest :google-play-services_lib:processReleaseResources :google-play-services_lib:generateReleaseSources :google-play-services_lib:processReleaseJavaRes UP-TO-DATE :google-play-services_lib:compileReleaseJavaWithJavac :google-play-services_lib:packageReleaseJar :google-play-services_lib:compileReleaseNdk UP-TO-DATE :google-play-services_lib:packageReleaseJniLibs UP-TO-DATE :google-play-services_lib:packageReleaseLocalJar :google-play-services_lib:packageReleaseRenderscript UP-TO-DATE :google-play-services_lib:bundleRelease :com.companyname.GMProjectTemplate:prepareComAndroidSupportMultidex101Library :com.companyname.GMProjectTemplate:prepareComAndroidSupportSupportV42311Library :com.companyname.GMProjectTemplate:prepareDefaultGooglePlayServices_libUnspecifiedLibrary :com.companyname.GMProjectTemplate:prepareReleaseDependencies :com.companyname.GMProjectTemplate:compileReleaseAidl :com.companyname.GMProjectTemplate:compileReleaseRenderscript :com.companyname.GMProjectTemplate:generateReleaseBuildConfig :com.companyname.GMProjectTemplate:generateReleaseAssets UP-TO-DATE :com.companyname.GMProjectTemplate:mergeReleaseAssets :com.companyname.GMProjectTemplate:generateReleaseResValues :com.companyname.GMProjectTemplate:generateReleaseResources :com.companyname.GMProjectTemplate:mergeReleaseResourcesAAPT err(20525479): C:\G\DT\Android\Default\com.companyname.GMProjectTemplate\src\main\res\drawable-xxhdpi\icon.png: libpng warning: iCCP: Not recognizing known sRGB profile that has been edited AAPT err(18332573): C:\G\DT\Android\Default\com.companyname.GMProjectTemplate\src\main\res\drawable-mdpi\icon.png: libpng warning: iCCP: Not recognizing known sRGB profile that has been edited AAPT err(18332573): C:\G\DT\Android\Default\com.companyname.GMProjectTemplate\src\main\res\drawable-xxxhdpi\icon.png: libpng warning: iCCP: Not recognizing known sRGB profile that has been edited AAPT err(18332573): C:\G\DT\Android\Default\com.companyname.GMProjectTemplate\src\main\res\drawable-xhdpi\icon.png: libpng warning: iCCP: Not recognizing known sRGB profile that has been edited AAPT err(18332573): C:\G\DT\Android\Default\com.companyname.GMProjectTemplate\src\main\res\drawable\icon.png: libpng warning: iCCP: Not recognizing known sRGB profile that has been edited AAPT err(1866704): C:\G\DT\Android\Default\com.companyname.GMProjectTemplate\src\main\res\drawable-hdpi\icon.png: libpng warning: iCCP: Not recognizing known sRGB profile that has been edited AAPT err(2227274): C:\G\DT\Android\Default\com.companyname.GMProjectTemplate\src\main\res\drawable-ldpi\icon.png: libpng warning: iCCP: Not recognizing known sRGB profile that has been edited :com.companyname.GMProjectTemplate:processArmeabi-v7aReleaseManifestC:\G\DT\Android\Default\com.companyname.GMProjectTemplate\src\main\AndroidManifest.xml:56:5-118 Error: Element meta-data#com.google.android.gms.version at AndroidManifest.xml:56:5-118 duplicated with element declared at AndroidManifest.xml:43:5-120 C:\G\DT\Android\Default\com.companyname.GMProjectTemplate\src\main\AndroidManifest.xml:57:5-229 Error: Element activity#com.google.android.gms.ads.AdActivity at AndroidManifest.xml:57:5-229 duplicated with element declared at AndroidManifest.xml:46:1-176 C:\G\DT\Android\Default\com.companyname.GMProjectTemplate\src\main\AndroidManifest.xml Error: Validation failed, exiting FAILED FAILURE: Build failed with an exception. * What went wrong: Execution failed for task ':com.companyname.GMProjectTemplate:processArmeabi-v7aReleaseManifest'. > Manifest merger failed with multiple errors, see logs * Try: Run with --stacktrace option to get the stack trace. Run with --info or --debug option to get more log output. BUILD FAILED Total time: 11.531 secs Create finished: 2:48:05 AM
Comments
0 B
|👍
/👎