In file included from /mnt/md0/Downloads/android-x86/kernel/include/linux/crypto.h:22:0,
from /mnt/md0/Downloads/android-x86/kernel/arch/x86/kernel/asm-offsets.c:8:
/mnt/md0/Downloads/android-x86/kernel/include/linux/list.h: In function 'list_del':
/mnt/md0/Downloads/android-x86/kernel/include/linux/list.h:125:2: error: implicit declaration of function '_AC' [-Werror=implicit-function-declaration]
/mnt/md0/Downloads/android-x86/kernel/include/linux/list.h:125:16: error: 'UL' undeclared (first use in this function)
/mnt/md0/Downloads/android-x86/kernel/include/linux/list.h:125:16: note: each undeclared identifier is reported only once for each function it appears in
/mnt/md0/Downloads/android-x86/kernel/include/linux/list.h: In function 'hlist_del':
/mnt/md0/Downloads/android-x86/kernel/include/linux/list.h:643:12: error: 'UL' undeclared (first use in this function)
In file included from /mnt/md0/Downloads/android-x86/kernel/arch/x86/include/asm/page.h:11:0,
from /mnt/md0/Downloads/android-x86/kernel/arch/x86/include/asm/thread_info.h:11,
from /mnt/md0/Downloads/android-x86/kernel/include/linux/thread_info.h:25,
from /mnt/md0/Downloads/android-x86/kernel/arch/x86/include/asm/preempt.h:6,
from /mnt/md0/Downloads/android-x86/kernel/include/linux/preempt.h:59,
from /mnt/md0/Downloads/android-x86/kernel/include/linux/spinlock.h:50,
from /mnt/md0/Downloads/android-x86/kernel/include/linux/mmzone.h:7,
from /mnt/md0/Downloads/android-x86/kernel/include/linux/gfp.h:5,
from /mnt/md0/Downloads/android-x86/kernel/include/linux/slab.h:14,
from /mnt/md0/Downloads/android-x86/kernel/include/linux/crypto.h:24,
from /mnt/md0/Downloads/android-x86/kernel/arch/x86/kernel/asm-offsets.c:8:
/mnt/md0/Downloads/android-x86/kernel/arch/x86/include/asm/page_64.h: In function '__phys_addr_nodebug':
/mnt/md0/Downloads/android-x86/kernel/arch/x86/include/asm/page_64.h:14:24: error: 'UL' undeclared (first use in this function)
In file included from /mnt/md0/Downloads/android-x86/kernel/arch/x86/include/asm/math_emu.h:4:0,
from /mnt/md0/Downloads/android-x86/kernel/arch/x86/include/asm/processor.h:11,
from /mnt/md0/Downloads/android-x86/kernel/arch/x86/include/asm/cpufeature.h:4,
from /mnt/md0/Downloads/android-x86/kernel/arch/x86/include/asm/thread_info.h:52,
from /mnt/md0/Downloads/android-x86/kernel/include/linux/thread_info.h:25,
from /mnt/md0/Downloads/android-x86/kernel/arch/x86/include/asm/preempt.h:6,
from /mnt/md0/Downloads/android-x86/kernel/include/linux/preempt.h:59,
from /mnt/md0/Downloads/android-x86/kernel/include/linux/spinlock.h:50,
from /mnt/md0/Downloads/android-x86/kernel/include/linux/mmzone.h:7,
from /mnt/md0/Downloads/android-x86/kernel/include/linux/gfp.h:5,
from /mnt/md0/Downloads/android-x86/kernel/include/linux/slab.h:14,
from /mnt/md0/Downloads/android-x86/kernel/include/linux/crypto.h:24,
from /mnt/md0/Downloads/android-x86/kernel/arch/x86/kernel/asm-offsets.c:8:
/mnt/md0/Downloads/android-x86/kernel/arch/x86/include/asm/ptrace.h: In function 'regs_within_kernel_stack':
/mnt/md0/Downloads/android-x86/kernel/arch/x86/include/asm/ptrace.h:194:20: error: 'UL' undeclared (first use in this function)
In file included from /mnt/md0/Downloads/android-x86/kernel/arch/x86/include/asm/processor.h:18:0,
from /mnt/md0/Downloads/android-x86/kernel/arch/x86/include/asm/cpufeature.h:4,
from /mnt/md0/Downloads/android-x86/kernel/arch/x86/include/asm/thread_info.h:52,
from /mnt/md0/Downloads/android-x86/kernel/include/linux/thread_info.h:25,
from /mnt/md0/Downloads/android-x86/kernel/arch/x86/include/asm/preempt.h:6,
from /mnt/md0/Downloads/android-x86/kernel/include/linux/preempt.h:59,
from /mnt/md0/Downloads/android-x86/kernel/include/linux/spinlock.h:50,
from /mnt/md0/Downloads/android-x86/kernel/include/linux/mmzone.h:7,
from /mnt/md0/Downloads/android-x86/kernel/include/linux/gfp.h:5,
from /mnt/md0/Downloads/android-x86/kernel/include/linux/slab.h:14,
from /mnt/md0/Downloads/android-x86/kernel/include/linux/crypto.h:24,
from /mnt/md0/Downloads/android-x86/kernel/arch/x86/kernel/asm-offsets.c:8:
/mnt/md0/Downloads/android-x86/kernel/arch/x86/include/asm/pgtable_types.h: In function 'pgd_flags':
/mnt/md0/Downloads/android-x86/kernel/arch/x86/include/asm/pgtable_types.h:299:31: error: 'UL' undeclared (first use in this function)
/mnt/md0/Downloads/android-x86/kernel/arch/x86/include/asm/pgtable_types.h: In function 'pud_pfn_mask':
/mnt/md0/Downloads/android-x86/kernel/arch/x86/include/asm/pgtable_types.h:346:2: error: implicit declaration of function '_AT' [-Werror=implicit-function-declaration]
/mnt/md0/Downloads/android-x86/kernel/arch/x86/include/asm/pgtable_types.h:346:28: error: expected expression before 'pteval_t'
/mnt/md0/Downloads/android-x86/kernel/arch/x86/include/asm/pgtable_types.h:347:10: error: 'UL' undeclared (first use in this function)
/mnt/md0/Downloads/android-x86/kernel/arch/x86/include/asm/pgtable_types.h: In function 'pmd_pfn_mask':
/mnt/md0/Downloads/android-x86/kernel/arch/x86/include/asm/pgtable_types.h:364:28: error: expected expression before 'pteval_t'
/mnt/md0/Downloads/android-x86/kernel/arch/x86/include/asm/pgtable_types.h:365:10: error: 'UL' undeclared (first use in this function)
/mnt/md0/Downloads/android-x86/kernel/arch/x86/include/asm/pgtable_types.h: In function 'pte_flags':
/mnt/md0/Downloads/android-x86/kernel/arch/x86/include/asm/pgtable_types.h:392:31: error: 'UL' undeclared (first use in this function)
/mnt/md0/Downloads/android-x86/kernel/arch/x86/include/asm/pgtable_types.h: In function 'pgprot2cachemode':
/mnt/md0/Downloads/android-x86/kernel/arch/x86/include/asm/pgtable_types.h:424:32: error: expected expression before 'pteval_t'
/mnt/md0/Downloads/android-x86/kernel/arch/x86/include/asm/pgtable_types.h:424:32: error: expected expression before 'pteval_t'
/mnt/md0/Downloads/android-x86/kernel/arch/x86/include/asm/pgtable_types.h:424:32: error: expected expression before 'pteval_t'
/mnt/md0/Downloads/android-x86/kernel/arch/x86/include/asm/pgtable_types.h: In function 'pgprot_4k_2_large':
/mnt/md0/Downloads/android-x86/kernel/arch/x86/include/asm/pgtable_types.h:434:29: error: expected expression before 'pteval_t'
/mnt/md0/Downloads/android-x86/kernel/arch/x86/include/asm/pgtable_types.h:434:41: error: expected expression before 'pteval_t'
/mnt/md0/Downloads/android-x86/kernel/arch/x86/include/asm/pgtable_types.h:435:11: error: expected expression before 'pteval_t'
/mnt/md0/Downloads/android-x86/kernel/arch/x86/include/asm/pgtable_types.h: In function 'pgprot_large_2_4k':
/mnt/md0/Downloads/android-x86/kernel/arch/x86/include/asm/pgtable_types.h:443:29: error: expected expression before 'pteval_t'
/mnt/md0/Downloads/android-x86/kernel/arch/x86/include/asm/pgtable_types.h:443:41: error: expected expression before 'pteval_t'
/mnt/md0/Downloads/android-x86/kernel/arch/x86/include/asm/pgtable_types.h:444:14: error: expected expression before 'pteval_t'
In file included from /mnt/md0/Downloads/android-x86/kernel/arch/x86/include/asm/processor.h:24:0,
from /mnt/md0/Downloads/android-x86/kernel/arch/x86/include/asm/cpufeature.h:4,
from /mnt/md0/Downloads/android-x86/kernel/arch/x86/include/asm/thread_info.h:52,
from /mnt/md0/Downloads/android-x86/kernel/include/linux/thread_info.h:25,
from /mnt/md0/Downloads/android-x86/kernel/arch/x86/include/asm/preempt.h:6,
from /mnt/md0/Downloads/android-x86/kernel/include/linux/preempt.h:59,
from /mnt/md0/Downloads/android-x86/kernel/include/linux/spinlock.h:50,
from /mnt/md0/Downloads/android-x86/kernel/include/linux/mmzone.h:7,
from /mnt/md0/Downloads/android-x86/kernel/include/linux/gfp.h:5,
from /mnt/md0/Downloads/android-x86/kernel/include/linux/slab.h:14,
from /mnt/md0/Downloads/android-x86/kernel/include/linux/crypto.h:24,
from /mnt/md0/Downloads/android-x86/kernel/arch/x86/kernel/asm-offsets.c:8:
/mnt/md0/Downloads/android-x86/kernel/arch/x86/include/asm/fpu/types.h: At top level:
/mnt/md0/Downloads/android-x86/kernel/arch/x86/include/asm/fpu/types.h:269:15: error: 'UL' undeclared here (not in a function)
In file included from /mnt/md0/Downloads/android-x86/kernel/include/linux/irqflags.h:15:0,
from /mnt/md0/Downloads/android-x86/kernel/arch/x86/include/asm/processor.h:31,
from /mnt/md0/Downloads/android-x86/kernel/arch/x86/include/asm/cpufeature.h:4,
from /mnt/md0/Downloads/android-x86/kernel/arch/x86/include/asm/thread_info.h:52,
from /mnt/md0/Downloads/android-x86/kernel/include/linux/thread_info.h:25,
from /mnt/md0/Downloads/android-x86/kernel/arch/x86/include/asm/preempt.h:6,
from /mnt/md0/Downloads/android-x86/kernel/include/linux/preempt.h:59,
from /mnt/md0/Downloads/android-x86/kernel/include/linux/spinlock.h:50,
from /mnt/md0/Downloads/android-x86/kernel/include/linux/mmzone.h:7,
from /mnt/md0/Downloads/android-x86/kernel/include/linux/gfp.h:5,
from /mnt/md0/Downloads/android-x86/kernel/include/linux/slab.h:14,
from /mnt/md0/Downloads/android-x86/kernel/include/linux/crypto.h:24,
from /mnt/md0/Downloads/android-x86/kernel/arch/x86/kernel/asm-offsets.c:8:
/mnt/md0/Downloads/android-x86/kernel/arch/x86/include/asm/irqflags.h: In function 'arch_irqs_disabled_flags':
/mnt/md0/Downloads/android-x86/kernel/arch/x86/include/asm/irqflags.h:160:2: error: implicit declaration of function '_BITUL' [-Werror=implicit-function-declaration]
HOSTLD scripts/mod/modpost
In file included from /mnt/md0/Downloads/android-x86/kernel/include/linux/sched.h:27:0,
from /mnt/md0/Downloads/android-x86/kernel/include/linux/kasan.h:4,
from /mnt/md0/Downloads/android-x86/kernel/include/linux/slab.h:118,
from /mnt/md0/Downloads/android-x86/kernel/include/linux/crypto.h:24,
from /mnt/md0/Downloads/android-x86/kernel/arch/x86/kernel/asm-offsets.c:8:
/mnt/md0/Downloads/android-x86/kernel/include/linux/mm_types.h: At top level:
/mnt/md0/Downloads/android-x86/kernel/include/linux/mm_types.h:236:30: error: missing binary operator before token "("
/mnt/md0/Downloads/android-x86/kernel/include/linux/mm_types.h:250:6: warning: "_AC" is not defined [-Wundef]
/mnt/md0/Downloads/android-x86/kernel/include/linux/mm_types.h:250:6: error: missing binary operator before token "("
In file included from /mnt/md0/Downloads/android-x86/kernel/include/linux/mm.h:68:0,
from /mnt/md0/Downloads/android-x86/kernel/include/linux/suspend.h:8,
from /mnt/md0/Downloads/android-x86/kernel/arch/x86/kernel/asm-offsets.c:12:
/mnt/md0/Downloads/android-x86/kernel/arch/x86/include/asm/pgtable.h: In function 'pte_dirty':
/mnt/md0/Downloads/android-x86/kernel/arch/x86/include/asm/pgtable.h:111:26: error: expected expression before 'pteval_t'
/mnt/md0/Downloads/android-x86/kernel/arch/x86/include/asm/pgtable.h: In function 'pte_young':
/mnt/md0/Downloads/android-x86/kernel/arch/x86/include/asm/pgtable.h:130:26: error: expected expression before 'pteval_t'
/mnt/md0/Downloads/android-x86/kernel/arch/x86/include/asm/pgtable.h: In function 'pmd_dirty':
/mnt/md0/Downloads/android-x86/kernel/arch/x86/include/asm/pgtable.h:135:26: error: expected expression before 'pteval_t'
/mnt/md0/Downloads/android-x86/kernel/arch/x86/include/asm/pgtable.h: In function 'pmd_young':
/mnt/md0/Downloads/android-x86/kernel/arch/x86/include/asm/pgtable.h:140:26: error: expected expression before 'pteval_t'
/mnt/md0/Downloads/android-x86/kernel/arch/x86/include/asm/pgtable.h: In function 'pte_write':
/mnt/md0/Downloads/android-x86/kernel/arch/x86/include/asm/pgtable.h:145:26: error: expected expression before 'pteval_t'
/mnt/md0/Downloads/android-x86/kernel/arch/x86/include/asm/pgtable.h: In function 'pte_huge':
/mnt/md0/Downloads/android-x86/kernel/arch/x86/include/asm/pgtable.h:150:26: error: expected expression before 'pteval_t'
/mnt/md0/Downloads/android-x86/kernel/arch/x86/include/asm/pgtable.h: In function 'pte_global':
/mnt/md0/Downloads/android-x86/kernel/arch/x86/include/asm/pgtable.h:155:26: error: expected expression before 'pteval_t'
/mnt/md0/Downloads/android-x86/kernel/arch/x86/include/asm/pgtable.h: In function 'pte_exec':
/mnt/md0/Downloads/android-x86/kernel/arch/x86/include/asm/pgtable.h:160:28: error: expected expression before 'pteval_t'
/mnt/md0/Downloads/android-x86/kernel/arch/x86/include/asm/pgtable.h: In function 'pte_special':
/mnt/md0/Downloads/android-x86/kernel/arch/x86/include/asm/pgtable.h:165:26: error: expected expression before 'pteval_t'
/mnt/md0/Downloads/android-x86/kernel/arch/x86/include/asm/pgtable.h: In function 'pmd_large':
/mnt/md0/Downloads/android-x86/kernel/arch/x86/include/asm/pgtable.h:202:26: error: expected expression before 'pteval_t'
/mnt/md0/Downloads/android-x86/kernel/arch/x86/include/asm/pgtable.h: In function 'pte_mkclean':
/mnt/md0/Downloads/android-x86/kernel/arch/x86/include/asm/pgtable.h:241:30: error: expected expression before 'pteval_t'
/mnt/md0/Downloads/android-x86/kernel/arch/x86/include/asm/pgtable.h: In function 'pte_mkold':
/mnt/md0/Downloads/android-x86/kernel/arch/x86/include/asm/pgtable.h:246:30: error: expected expression before 'pteval_t'
/mnt/md0/Downloads/android-x86/kernel/arch/x86/include/asm/pgtable.h: In function 'pte_wrprotect':
/mnt/md0/Downloads/android-x86/kernel/arch/x86/include/asm/pgtable.h:251:30: error: expected expression before 'pteval_t'
/mnt/md0/Downloads/android-x86/kernel/arch/x86/include/asm/pgtable.h: In function 'pte_mkexec':
/mnt/md0/Downloads/android-x86/kernel/arch/x86/include/asm/pgtable.h:256:30: error: expected expression before 'pteval_t'
/mnt/md0/Downloads/android-x86/kernel/arch/x86/include/asm/pgtable.h: In function 'pte_mkdirty':
/mnt/md0/Downloads/android-x86/kernel/arch/x86/include/asm/pgtable.h:261:28: error: expected expression before 'pteval_t'
/mnt/md0/Downloads/android-x86/kernel/arch/x86/include/asm/pgtable.h:261:42: error: expected expression before 'pteval_t'
/mnt/md0/Downloads/android-x86/kernel/arch/x86/include/asm/pgtable.h: In function 'pte_mkyoung':
/mnt/md0/Downloads/android-x86/kernel/arch/x86/include/asm/pgtable.h:266:28: error: expected expression before 'pteval_t'
/mnt/md0/Downloads/android-x86/kernel/arch/x86/include/asm/pgtable.h: In function 'pte_mkwrite':
/mnt/md0/Downloads/android-x86/kernel/arch/x86/include/asm/pgtable.h:271:28: error: expected expression before 'pteval_t'
/mnt/md0/Downloads/android-x86/kernel/arch/x86/include/asm/pgtable.h: In function 'pte_mkhuge':
/mnt/md0/Downloads/android-x86/kernel/arch/x86/include/asm/pgtable.h:276:28: error: expected expression before 'pteval_t'
/mnt/md0/Downloads/android-x86/kernel/arch/x86/include/asm/pgtable.h: In function 'pte_clrhuge':
/mnt/md0/Downloads/android-x86/kernel/arch/x86/include/asm/pgtable.h:281:30: error: expected expression before 'pteval_t'
/mnt/md0/Downloads/android-x86/kernel/arch/x86/include/asm/pgtable.h: In function 'pte_mkglobal':
/mnt/md0/Downloads/android-x86/kernel/arch/x86/include/asm/pgtable.h:286:28: error: expected expression before 'pteval_t'
/mnt/md0/Downloads/android-x86/kernel/arch/x86/include/asm/pgtable.h: In function 'pte_clrglobal':
/mnt/md0/Downloads/android-x86/kernel/arch/x86/include/asm/pgtable.h:291:30: error: expected expression before 'pteval_t'
/mnt/md0/Downloads/android-x86/kernel/arch/x86/include/asm/pgtable.h: In function 'pte_mkspecial':
/mnt/md0/Downloads/android-x86/kernel/arch/x86/include/asm/pgtable.h:296:28: error: expected expression before 'pteval_t'
/mnt/md0/Downloads/android-x86/kernel/arch/x86/include/asm/pgtable.h: In function 'pte_mkdevmap':
/mnt/md0/Downloads/android-x86/kernel/arch/x86/include/asm/pgtable.h:301:28: error: expected expression before 'pteval_t'
/mnt/md0/Downloads/android-x86/kernel/arch/x86/include/asm/pgtable.h:301:42: error: expected expression before 'u64'
/mnt/md0/Downloads/android-x86/kernel/arch/x86/include/asm/pgtable.h: In function 'pmd_mkold':
/mnt/md0/Downloads/android-x86/kernel/arch/x86/include/asm/pgtable.h:320:30: error: expected expression before 'pteval_t'
/mnt/md0/Downloads/android-x86/kernel/arch/x86/include/asm/pgtable.h: In function 'pmd_mkclean':
/mnt/md0/Downloads/android-x86/kernel/arch/x86/include/asm/pgtable.h:325:30: error: expected expression before 'pteval_t'
/mnt/md0/Downloads/android-x86/kernel/arch/x86/include/asm/pgtable.h: In function 'pmd_wrprotect':
/mnt/md0/Downloads/android-x86/kernel/arch/x86/include/asm/pgtable.h:330:30: error: expected expression before 'pteval_t'
/mnt/md0/Downloads/android-x86/kernel/arch/x86/include/asm/pgtable.h: In function 'pmd_mkdirty':
/mnt/md0/Downloads/android-x86/kernel/arch/x86/include/asm/pgtable.h:335:28: error: expected expression before 'pteval_t'
/mnt/md0/Downloads/android-x86/kernel/arch/x86/include/asm/pgtable.h:335:42: error: expected expression before 'pteval_t'
/mnt/md0/Downloads/android-x86/kernel/arch/x86/include/asm/pgtable.h: In function 'pmd_mkdevmap':
/mnt/md0/Downloads/android-x86/kernel/arch/x86/include/asm/pgtable.h:340:28: error: expected expression before 'u64'
/mnt/md0/Downloads/android-x86/kernel/arch/x86/include/asm/pgtable.h: In function 'pmd_mkhuge':
/mnt/md0/Downloads/android-x86/kernel/arch/x86/include/asm/pgtable.h:345:28: error: expected expression before 'pteval_t'
/mnt/md0/Downloads/android-x86/kernel/arch/x86/include/asm/pgtable.h: In function 'pmd_mkyoung':
/mnt/md0/Downloads/android-x86/kernel/arch/x86/include/asm/pgtable.h:350:28: error: expected expression before 'pteval_t'
/mnt/md0/Downloads/android-x86/kernel/arch/x86/include/asm/pgtable.h: In function 'pmd_mkwrite':
/mnt/md0/Downloads/android-x86/kernel/arch/x86/include/asm/pgtable.h:355:28: error: expected expression before 'pteval_t'
/mnt/md0/Downloads/android-x86/kernel/arch/x86/include/asm/pgtable.h: In function 'pte_soft_dirty':
/mnt/md0/Downloads/android-x86/kernel/arch/x86/include/asm/pgtable.h:361:26: error: expected expression before 'pteval_t'
/mnt/md0/Downloads/android-x86/kernel/arch/x86/include/asm/pgtable.h: In function 'pmd_soft_dirty':
/mnt/md0/Downloads/android-x86/kernel/arch/x86/include/asm/pgtable.h:366:26: error: expected expression before 'pteval_t'
/mnt/md0/Downloads/android-x86/kernel/arch/x86/include/asm/pgtable.h: In function 'pte_mksoft_dirty':
/mnt/md0/Downloads/android-x86/kernel/arch/x86/include/asm/pgtable.h:371:28: error: expected expression before 'pteval_t'
/mnt/md0/Downloads/android-x86/kernel/arch/x86/include/asm/pgtable.h: In function 'pmd_mksoft_dirty':
/mnt/md0/Downloads/android-x86/kernel/arch/x86/include/asm/pgtable.h:376:28: error: expected expression before 'pteval_t'
/mnt/md0/Downloads/android-x86/kernel/arch/x86/include/asm/pgtable.h: In function 'pte_clear_soft_dirty':
/mnt/md0/Downloads/android-x86/kernel/arch/x86/include/asm/pgtable.h:381:30: error: expected expression before 'pteval_t'
/mnt/md0/Downloads/android-x86/kernel/arch/x86/include/asm/pgtable.h: In function 'pmd_clear_soft_dirty':
/mnt/md0/Downloads/android-x86/kernel/arch/x86/include/asm/pgtable.h:386:30: error: expected expression before 'pteval_t'
/mnt/md0/Downloads/android-x86/kernel/arch/x86/include/asm/pgtable.h: In function 'massage_pgprot':
/mnt/md0/Downloads/android-x86/kernel/arch/x86/include/asm/pgtable.h:399:16: error: expected expression before 'pteval_t'
/mnt/md0/Downloads/android-x86/kernel/arch/x86/include/asm/pgtable.h: In function 'pmd_mknotpresent':
/mnt/md0/Downloads/android-x86/kernel/arch/x86/include/asm/pgtable.h:432:10: error: expected expression before 'pteval_t'
/mnt/md0/Downloads/android-x86/kernel/arch/x86/include/asm/pgtable.h:432:10: error: expected expression before 'pteval_t'
/mnt/md0/Downloads/android-x86/kernel/arch/x86/include/asm/pgtable.h: In function 'pud_mkhuge':
/mnt/md0/Downloads/android-x86/kernel/arch/x86/include/asm/pgtable.h:451:28: error: expected expression before 'pteval_t'
/mnt/md0/Downloads/android-x86/kernel/arch/x86/include/asm/pgtable.h: In function 'pte_modify':
/mnt/md0/Downloads/android-x86/kernel/arch/x86/include/asm/pgtable.h:464:9: error: expected expression before 'pteval_t'
/mnt/md0/Downloads/android-x86/kernel/arch/x86/include/asm/pgtable.h:464:9: error: expected expression before 'pteval_t'
/mnt/md0/Downloads/android-x86/kernel/arch/x86/include/asm/pgtable.h:464:9: error: expected expression before 'pteval_t'
/mnt/md0/Downloads/android-x86/kernel/arch/x86/include/asm/pgtable.h:464:9: error: expected expression before 'pteval_t'
/mnt/md0/Downloads/android-x86/kernel/arch/x86/include/asm/pgtable.h:464:9: error: expected expression before 'pteval_t'
/mnt/md0/Downloads/android-x86/kernel/arch/x86/include/asm/pgtable.h:464:9: error: expected expression before 'pteval_t'
/mnt/md0/Downloads/android-x86/kernel/arch/x86/include/asm/pgtable.h:464:9: error: expected expression before 'u64'
/mnt/md0/Downloads/android-x86/kernel/arch/x86/include/asm/pgtable.h:465:36: error: expected expression before 'pteval_t'
/mnt/md0/Downloads/android-x86/kernel/arch/x86/include/asm/pgtable.h:465:36: error: expected expression before 'pteval_t'
/mnt/md0/Downloads/android-x86/kernel/arch/x86/include/asm/pgtable.h:465:36: error: expected expression before 'pteval_t'
/mnt/md0/Downloads/android-x86/kernel/arch/x86/include/asm/pgtable.h:465:36: error: expected expression before 'pteval_t'
/mnt/md0/Downloads/android-x86/kernel/arch/x86/include/asm/pgtable.h:465:36: error: expected expression before 'pteval_t'
/mnt/md0/Downloads/android-x86/kernel/arch/x86/include/asm/pgtable.h:465:36: error: expected expression before 'pteval_t'
/mnt/md0/Downloads/android-x86/kernel/arch/x86/include/asm/pgtable.h:465:36: error: expected expression before 'u64'
/mnt/md0/Downloads/android-x86/kernel/arch/x86/include/asm/pgtable.h: In function 'pmd_modify':
/mnt/md0/Downloads/android-x86/kernel/arch/x86/include/asm/pgtable.h:474:9: error: expected expression before 'pteval_t'
/mnt/md0/Downloads/android-x86/kernel/arch/x86/include/asm/pgtable.h:474:9: error: expected expression before 'pteval_t'
/mnt/md0/Downloads/android-x86/kernel/arch/x86/include/asm/pgtable.h:474:9: error: expected expression before 'pteval_t'
/mnt/md0/Downloads/android-x86/kernel/arch/x86/include/asm/pgtable.h:474:9: error: expected expression before 'pteval_t'
/mnt/md0/Downloads/android-x86/kernel/arch/x86/include/asm/pgtable.h:474:9: error: expected expression before 'pteval_t'
/mnt/md0/Downloads/android-x86/kernel/arch/x86/include/asm/pgtable.h:474:9: error: expected expression before 'pteval_t'
/mnt/md0/Downloads/android-x86/kernel/arch/x86/include/asm/pgtable.h:474:9: error: expected expression before 'u64'
/mnt/md0/Downloads/android-x86/kernel/arch/x86/include/asm/pgtable.h:474:9: error: expected expression before 'pteval_t'
/mnt/md0/Downloads/android-x86/kernel/arch/x86/include/asm/pgtable.h:475:36: error: expected expression before 'pteval_t'
/mnt/md0/Downloads/android-x86/kernel/arch/x86/include/asm/pgtable.h:475:36: error: expected expression before 'pteval_t'
/mnt/md0/Downloads/android-x86/kernel/arch/x86/include/asm/pgtable.h:475:36: error: expected expression before 'pteval_t'
/mnt/md0/Downloads/android-x86/kernel/arch/x86/include/asm/pgtable.h:475:36: error: expected expression before 'pteval_t'
/mnt/md0/Downloads/android-x86/kernel/arch/x86/include/asm/pgtable.h:475:36: error: expected expression before 'pteval_t'
/mnt/md0/Downloads/android-x86/kernel/arch/x86/include/asm/pgtable.h:475:36: error: expected expression before 'pteval_t'
/mnt/md0/Downloads/android-x86/kernel/arch/x86/include/asm/pgtable.h:475:36: error: expected expression before 'u64'
/mnt/md0/Downloads/android-x86/kernel/arch/x86/include/asm/pgtable.h:475:36: error: expected expression before 'pteval_t'
/mnt/md0/Downloads/android-x86/kernel/arch/x86/include/asm/pgtable.h: In function 'pgprot_modify':
/mnt/md0/Downloads/android-x86/kernel/arch/x86/include/asm/pgtable.h:484:51: error: expected expression before 'pteval_t'
/mnt/md0/Downloads/android-x86/kernel/arch/x86/include/asm/pgtable.h:484:51: error: expected expression before 'pteval_t'
/mnt/md0/Downloads/android-x86/kernel/arch/x86/include/asm/pgtable.h:484:51: error: expected expression before 'pteval_t'
/mnt/md0/Downloads/android-x86/kernel/arch/x86/include/asm/pgtable.h:484:51: error: expected expression before 'pteval_t'
/mnt/md0/Downloads/android-x86/kernel/arch/x86/include/asm/pgtable.h:484:51: error: expected expression before 'pteval_t'
/mnt/md0/Downloads/android-x86/kernel/arch/x86/include/asm/pgtable.h:484:51: error: expected expression before 'pteval_t'
/mnt/md0/Downloads/android-x86/kernel/arch/x86/include/asm/pgtable.h:484:51: error: expected expression before 'u64'
In file included from /mnt/md0/Downloads/android-x86/kernel/arch/x86/include/asm/pgtable_64.h:238:0,
from /mnt/md0/Downloads/android-x86/kernel/arch/x86/include/asm/pgtable.h:534,
from /mnt/md0/Downloads/android-x86/kernel/include/linux/mm.h:68,
from /mnt/md0/Downloads/android-x86/kernel/include/linux/suspend.h:8,
from /mnt/md0/Downloads/android-x86/kernel/arch/x86/kernel/asm-offsets.c:12:
/mnt/md0/Downloads/android-x86/kernel/arch/x86/include/asm/pgtable-invert.h: In function '__pte_needs_invert':
/mnt/md0/Downloads/android-x86/kernel/arch/x86/include/asm/pgtable-invert.h:18:24: error: expected expression before 'pteval_t'
In file included from /mnt/md0/Downloads/android-x86/kernel/include/linux/mm.h:68:0,
from /mnt/md0/Downloads/android-x86/kernel/include/linux/suspend.h:8,
from /mnt/md0/Downloads/android-x86/kernel/arch/x86/kernel/asm-offsets.c:12:
/mnt/md0/Downloads/android-x86/kernel/arch/x86/include/asm/pgtable.h: In function 'pte_none':
/mnt/md0/Downloads/android-x86/kernel/arch/x86/include/asm/pgtable.h:544:23: error: expected expression before 'pteval_t'
/mnt/md0/Downloads/android-x86/kernel/arch/x86/include/asm/pgtable.h:544:23: error: expected expression before 'pteval_t'
/mnt/md0/Downloads/android-x86/kernel/arch/x86/include/asm/pgtable.h: In function 'pte_present':
/mnt/md0/Downloads/android-x86/kernel/arch/x86/include/asm/pgtable.h:555:25: error: expected expression before 'pteval_t'
/mnt/md0/Downloads/android-x86/kernel/arch/x86/include/asm/pgtable.h:555:41: error: expected expression before 'pteval_t'
/mnt/md0/Downloads/android-x86/kernel/arch/x86/include/asm/pgtable.h: In function 'pte_devmap':
/mnt/md0/Downloads/android-x86/kernel/arch/x86/include/asm/pgtable.h:561:25: error: expected expression before 'u64'
/mnt/md0/Downloads/android-x86/kernel/arch/x86/include/asm/pgtable.h:561:42: error: expected expression before 'u64'
/mnt/md0/Downloads/android-x86/kernel/arch/x86/include/asm/pgtable.h: In function 'pte_accessible':
/mnt/md0/Downloads/android-x86/kernel/arch/x86/include/asm/pgtable.h:568:21: error: expected expression before 'pteval_t'
/mnt/md0/Downloads/android-x86/kernel/arch/x86/include/asm/pgtable.h:571:22: error: expected expression before 'pteval_t'
/mnt/md0/Downloads/android-x86/kernel/arch/x86/include/asm/pgtable.h: In function 'pte_hidden':
/mnt/md0/Downloads/android-x86/kernel/arch/x86/include/asm/pgtable.h:580:26: error: expected expression before 'pteval_t'
/mnt/md0/Downloads/android-x86/kernel/arch/x86/include/asm/pgtable.h: In function 'pmd_present':
/mnt/md0/Downloads/android-x86/kernel/arch/x86/include/asm/pgtable.h:591:27: error: expected expression before 'pteval_t'
/mnt/md0/Downloads/android-x86/kernel/arch/x86/include/asm/pgtable.h:591:43: error: expected expression before 'pteval_t'
/mnt/md0/Downloads/android-x86/kernel/arch/x86/include/asm/pgtable.h:591:60: error: expected expression before 'pteval_t'
/mnt/md0/Downloads/android-x86/kernel/arch/x86/include/asm/pgtable.h: In function 'pmd_none':
/mnt/md0/Downloads/android-x86/kernel/arch/x86/include/asm/pgtable.h:617:17: error: expected expression before 'pteval_t'
/mnt/md0/Downloads/android-x86/kernel/arch/x86/include/asm/pgtable.h:617:17: error: expected expression before 'pteval_t'
/mnt/md0/Downloads/android-x86/kernel/arch/x86/include/asm/pgtable.h: In function 'pmd_bad':
/mnt/md0/Downloads/android-x86/kernel/arch/x86/include/asm/pgtable.h:669:28: error: expected expression before 'pteval_t'
/mnt/md0/Downloads/android-x86/kernel/arch/x86/include/asm/pgtable.h:669:43: error: expected expression before 'pteval_t'
/mnt/md0/Downloads/android-x86/kernel/arch/x86/include/asm/pgtable.h:669:43: error: expected expression before 'pteval_t'
/mnt/md0/Downloads/android-x86/kernel/arch/x86/include/asm/pgtable.h:669:43: error: expected expression before 'pteval_t'
/mnt/md0/Downloads/android-x86/kernel/arch/x86/include/asm/pgtable.h:669:43: error: expected expression before 'pteval_t'
/mnt/md0/Downloads/android-x86/kernel/arch/x86/include/asm/pgtable.h: In function 'pud_none':
/mnt/md0/Downloads/android-x86/kernel/arch/x86/include/asm/pgtable.h:680:34: error: expected expression before 'pteval_t'
/mnt/md0/Downloads/android-x86/kernel/arch/x86/include/asm/pgtable.h:680:34: error: expected expression before 'pteval_t'
/mnt/md0/Downloads/android-x86/kernel/arch/x86/include/asm/pgtable.h: In function 'pud_present':
/mnt/md0/Downloads/android-x86/kernel/arch/x86/include/asm/pgtable.h:685:26: error: expected expression before 'pteval_t'
/mnt/md0/Downloads/android-x86/kernel/arch/x86/include/asm/pgtable.h: In function 'pud_large':
/mnt/md0/Downloads/android-x86/kernel/arch/x86/include/asm/pgtable.h:707:26: error: expected expression before 'pteval_t'
/mnt/md0/Downloads/android-x86/kernel/arch/x86/include/asm/pgtable.h:707:38: error: expected expression before 'pteval_t'
/mnt/md0/Downloads/android-x86/kernel/arch/x86/include/asm/pgtable.h:708:4: error: expected expression before 'pteval_t'
/mnt/md0/Downloads/android-x86/kernel/arch/x86/include/asm/pgtable.h:708:16: error: expected expression before 'pteval_t'
/mnt/md0/Downloads/android-x86/kernel/arch/x86/include/asm/pgtable.h: In function 'pud_bad':
/mnt/md0/Downloads/android-x86/kernel/arch/x86/include/asm/pgtable.h:713:29: error: expected expression before 'pteval_t'
/mnt/md0/Downloads/android-x86/kernel/arch/x86/include/asm/pgtable.h:713:29: error: expected expression before 'pteval_t'
/mnt/md0/Downloads/android-x86/kernel/arch/x86/include/asm/pgtable.h:713:29: error: expected expression before 'pteval_t'
/mnt/md0/Downloads/android-x86/kernel/arch/x86/include/asm/pgtable.h:713:29: error: expected expression before 'pteval_t'
/mnt/md0/Downloads/android-x86/kernel/arch/x86/include/asm/pgtable.h:713:45: error: expected expression before 'pteval_t'
/mnt/md0/Downloads/android-x86/kernel/arch/x86/include/asm/pgtable.h: In function 'pgd_present':
/mnt/md0/Downloads/android-x86/kernel/arch/x86/include/asm/pgtable.h:725:26: error: expected expression before 'pteval_t'
/mnt/md0/Downloads/android-x86/kernel/arch/x86/include/asm/pgtable.h: In function 'pgd_bad':
/mnt/md0/Downloads/android-x86/kernel/arch/x86/include/asm/pgtable.h:752:26: error: expected expression before 'pteval_t'
/mnt/md0/Downloads/android-x86/kernel/arch/x86/include/asm/pgtable.h:760:19: error: expected expression before 'pteval_t'
/mnt/md0/Downloads/android-x86/kernel/arch/x86/include/asm/pgtable.h:762:45: error: expected expression before 'pteval_t'
/mnt/md0/Downloads/android-x86/kernel/arch/x86/include/asm/pgtable.h:762:45: error: expected expression before 'pteval_t'
/mnt/md0/Downloads/android-x86/kernel/arch/x86/include/asm/pgtable.h:762:45: error: expected expression before 'pteval_t'
/mnt/md0/Downloads/android-x86/kernel/arch/x86/include/asm/pgtable.h:762:45: error: expected expression before 'pteval_t'
/mnt/md0/Downloads/android-x86/kernel/arch/x86/include/asm/pgtable.h: In function 'pmd_write':
/mnt/md0/Downloads/android-x86/kernel/arch/x86/include/asm/pgtable.h:946:26: error: expected expression before 'pteval_t'
/mnt/md0/Downloads/android-x86/kernel/arch/x86/include/asm/pgtable.h: In function 'pte_swp_mksoft_dirty':
/mnt/md0/Downloads/android-x86/kernel/arch/x86/include/asm/pgtable.h:1016:28: error: expected expression before 'pteval_t'
/mnt/md0/Downloads/android-x86/kernel/arch/x86/include/asm/pgtable.h: In function 'pte_swp_soft_dirty':
/mnt/md0/Downloads/android-x86/kernel/arch/x86/include/asm/pgtable.h:1021:26: error: expected expression before 'pteval_t'
/mnt/md0/Downloads/android-x86/kernel/arch/x86/include/asm/pgtable.h: In function 'pte_swp_clear_soft_dirty':
/mnt/md0/Downloads/android-x86/kernel/arch/x86/include/asm/pgtable.h:1026:30: error: expected expression before 'pteval_t'
/mnt/md0/Downloads/android-x86/kernel/arch/x86/include/asm/pgtable.h: In function 'pte_flags_pkey':
/mnt/md0/Downloads/android-x86/kernel/arch/x86/include/asm/pgtable.h:1054:22: error: expected expression before 'pteval_t'
/mnt/md0/Downloads/android-x86/kernel/arch/x86/include/asm/pgtable.h:1054:22: error: expected expression before 'pteval_t'
/mnt/md0/Downloads/android-x86/kernel/arch/x86/include/asm/pgtable.h:1054:22: error: expected expression before 'pteval_t'
/mnt/md0/Downloads/android-x86/kernel/arch/x86/include/asm/pgtable.h:1054:22: error: expected expression before 'pteval_t'
In file included from /mnt/md0/Downloads/android-x86/kernel/arch/x86/include/asm/suspend_64.h:9:0,
from /mnt/md0/Downloads/android-x86/kernel/arch/x86/include/asm/suspend.h:4,
from /mnt/md0/Downloads/android-x86/kernel/arch/x86/kernel/asm-offsets.c:18:
/mnt/md0/Downloads/android-x86/kernel/arch/x86/include/asm/desc.h: At top level:
/mnt/md0/Downloads/android-x86/kernel/arch/x86/include/asm/desc.h:44:1: error: requested alignment is not a constant
/mnt/md0/Downloads/android-x86/kernel/arch/x86/include/asm/desc.h:46:1: error: requested alignment is not a constant
cc1: some warnings being treated as errors
/mnt/md0/Downloads/android-x86/kernel/./Kbuild:56: recipe for target 'arch/x86/kernel/asm-offsets.s' failed
make[2]: *** [arch/x86/kernel/asm-offsets.s] Error 1
/mnt/md0/Downloads/android-x86/kernel/Makefile:1138: recipe for target 'prepare0' failed
make[1]: *** [prepare0] Error 2
make[1]: Leaving directory '/mnt/md0/Downloads/android-x86/out/target/product/x86_64/obj/kernel'
Makefile:152: recipe for target 'sub-make' failed
make: *** [sub-make] Error 2
make: Leaving directory '/mnt/md0/Downloads/android-x86/kernel'
[ 6% 6779/99246] target C++: libjavacore_32 <= li...luni/src/main/native/android_system_OsConstants.cpp
ninja: build stopped: subcommand failed.
16:18:01 ninja failed with: exit status 1
#### failed to build some targets (14:04 (mm:ss)) ####
Comments