htw icon

build output

htw | PRO | 05/23/22 02:44:17 PM UTC | 0 ⭐ | 382 👁️ | Never ⏰ | []
text |

27.49 KB

|

None

|

0 👍

/

0 👎

Build started...
1>------ Build started: Project: MQ2EasyFind, Configuration: Release x64 ------
2>------ Build started: Project: zone-utilities, Configuration: Release x64 ------
3>------ Build started: Project: MQ2Nav_Common, Configuration: Release x64 ------
4>------ Build started: Project: recast, Configuration: Release x64 ------
5>------ Build started: Project: MQ2Camera, Configuration: Release x64 ------
1>Checking vcpkg_mq manifest for MQ2EasyFind...
3>Checking vcpkg_mq manifest for MQ2Nav_Common...
2>Checking vcpkg_mq manifest for zone-utilities...
4>Checking vcpkg_mq manifest for Recast...
5>Checking vcpkg_mq manifest for MQ2Camera...
5>Updating version resource for MQ2Camera...
4>DebugDraw.cpp
4>DetourDebugDraw.cpp
4>RecastDebugDraw.cpp
4>RecastDump.cpp
4>DetourCrowd.cpp
4>DetourLocalBoundary.cpp
4>DetourObstacleAvoidance.cpp
4>DetourPathCorridor.cpp
4>DetourPathQueue.cpp
4>DetourProximityGrid.cpp
4>DetourTileCache.cpp
4>DetourTileCacheBuilder.cpp
4>DetourAlloc.cpp
4>DetourAssert.cpp
4>DetourCommon.cpp
4>DetourNavMesh.cpp
4>DetourNavMeshBuilder.cpp
4>DetourNavMeshQuery.cpp
4>DetourNode.cpp
4>Recast.cpp
4>RecastAlloc.cpp
4>RecastArea.cpp
4>RecastAssert.cpp
4>RecastContour.cpp
4>RecastFilter.cpp
4>RecastLayers.cpp
4>RecastMesh.cpp
4>RecastMeshDetail.cpp
4>RecastRasterization.cpp
4>RecastRegion.cpp
4>Recast.vcxproj -> C:\Src\MMO\mqnext\build\lib\x64\release\recast.lib
5>MQ2Camera.cpp
5>   Creating library C:\Src\MMO\mqnext\src\..\build\bin\release\plugins\MQ2Camera.lib and object C:\Src\MMO\mqnext\src\..\build\bin\release\plugins\MQ2Camera.exp
5>MQ2Camera.vcxproj -> C:\Src\MMO\mqnext\build\bin\release\plugins\MQ2Camera.dll
3>MQ2Nav_Common checking vcpkgs from C:\Src\MMO\mqnext\plugins\MQ2Nav\common\vcpkg_mq.txt
3>MQ2Nav_Common checking vcpkgs from C:\Src\MMO\mqnext\plugins\MQ2Nav\common\vcpkg_mq_x64.txt
3>Computing installation plan...
3>The following packages will be built and installed:
3>  * protobuf[core]:x64-windows -> 3.19.4
3>    protobuf[core]:x64-windows-static -> 3.19.4
3>    rapidjson[core]:x64-windows-static -> 2020-09-14#2
3>Additional packages (*) will be modified to complete this operation.
3>Detecting compiler hash for triplet x64-windows...
3>Detecting compiler hash for triplet x64-windows-static...
3>Restored 0 packages from C:\Users\htwmm\AppData\Local\vcpkg\archives in 147.2 us. Use --debug to see more details.
3>Starting package 1/3: protobuf:x64-windows
3>Building package protobuf[core]:x64-windows...
3>-- Downloading https://github.com/protocolbuffers/protobuf/archive/v3.19.4.tar.gz -> protocolbuffers-protobuf-v3.19.4.tar.gz...
3>-- Extracting source C:/Src/MMO/mqnext/contrib/vcpkg/downloads/protocolbuffers-protobuf-v3.19.4.tar.gz
3>-- Applying patch fix-static-build.patch
3>-- Applying patch fix-default-proto-file-path.patch
3>-- Using source at C:/Src/MMO/mqnext/contrib/vcpkg/buildtrees/protobuf/src/v3.19.4-3d4c96d55c.clean
3>-- Found external ninja('1.10.2').
3>-- Configuring x64-windows
1>MQ2EasyFind checking vcpkgs from C:\Src\MMO\mqnext\plugins\MQ2EasyFind\vcpkg_mq.txt
1>MQ2EasyFind waiting for another vcpkg.exe process to complete...
3>-- Building x64-windows-dbg
2>zone-utilities checking vcpkgs from C:\Src\MMO\mqnext\plugins\MQ2Nav\dependencies\zone-utilities\vcpkg_mq.txt
2>zone-utilities checking vcpkgs from C:\Src\MMO\mqnext\plugins\MQ2Nav\dependencies\zone-utilities\vcpkg_mq_x64.txt
2>compression.cpp
2>eqg_loader.cpp
2>eqg_model_loader.cpp
2>eqg_v4_loader.cpp
2>oriented_bounding_box.cpp
2>pfs.cpp
2>pfs_crc.cpp
2>s3d_loader.cpp
2>string_util.cpp
2>water_map.cpp
2>water_map_v1.cpp
2>water_map_v2.cpp
2>wld_fragment.cpp
2>zone_map.cpp
2>log_file.cpp
2>log_manager.cpp
2>log_stdout.cpp
2>zone-utilities.vcxproj -> C:\Src\MMO\mqnext\build\lib\x64\release\zone-utilities.lib
3>-- Building x64-windows-rel
1>MQ2EasyFind waiting for another vcpkg.exe process to complete...
3>-- Fixing pkgconfig file: C:/Src/MMO/mqnext/contrib/vcpkg/packages/protobuf_x64-windows/lib/pkgconfig/protobuf-lite.pc
3>-- Fixing pkgconfig file: C:/Src/MMO/mqnext/contrib/vcpkg/packages/protobuf_x64-windows/lib/pkgconfig/protobuf.pc
3>-- Using cached msys-mingw-w64-i686-pkg-config-0.29.2-3-any.pkg.tar.zst.
3>-- Using cached msys-mingw-w64-i686-libwinpthread-git-9.0.0.6373.5be8fcd83-1-any.pkg.tar.zst.
3>-- Using msys root at C:/Src/MMO/mqnext/contrib/vcpkg/downloads/tools/msys2/9a1ec3f33446b195
3>-- Fixing pkgconfig file: C:/Src/MMO/mqnext/contrib/vcpkg/packages/protobuf_x64-windows/debug/lib/pkgconfig/protobuf-lite.pc
3>-- Fixing pkgconfig file: C:/Src/MMO/mqnext/contrib/vcpkg/packages/protobuf_x64-windows/debug/lib/pkgconfig/protobuf.pc
3>-- Installing: C:/Src/MMO/mqnext/contrib/vcpkg/packages/protobuf_x64-windows/share/protobuf/copyright
3>-- Performing post-build validation
3>-- Performing post-build validation done
3>Stored binary cache: C:\Users\htwmm\AppData\Local\vcpkg\archives\cf\cf61d41fdafd34f0c77d92f01668e825f27f47fd7dfbe0ba9a22401483533759.zip
3>Installing package protobuf[core]:x64-windows...
3>Elapsed time for package protobuf:x64-windows: 1.356 min
3>Starting package 2/3: protobuf:x64-windows-static
3>Building package protobuf[core]:x64-windows-static...
3>-- Using cached protocolbuffers-protobuf-v3.19.4.tar.gz.
3>-- Cleaning sources at C:/Src/MMO/mqnext/contrib/vcpkg/buildtrees/protobuf/src/v3.19.4-3d4c96d55c.clean. Use --editable to skip cleaning for the packages you specify.
3>-- Extracting source C:/Src/MMO/mqnext/contrib/vcpkg/downloads/protocolbuffers-protobuf-v3.19.4.tar.gz
3>-- Applying patch fix-static-build.patch
3>-- Applying patch fix-default-proto-file-path.patch
3>-- Using source at C:/Src/MMO/mqnext/contrib/vcpkg/buildtrees/protobuf/src/v3.19.4-3d4c96d55c.clean
3>-- Found external ninja('1.10.2').
3>-- Configuring x64-windows-static
3>-- Building x64-windows-static-dbg
3>-- Building x64-windows-static-rel
1>MQ2EasyFind waiting for another vcpkg.exe process to complete...
3>-- Fixing pkgconfig file: C:/Src/MMO/mqnext/contrib/vcpkg/packages/protobuf_x64-windows-static/lib/pkgconfig/protobuf-lite.pc
3>-- Fixing pkgconfig file: C:/Src/MMO/mqnext/contrib/vcpkg/packages/protobuf_x64-windows-static/lib/pkgconfig/protobuf.pc
3>-- Using cached msys-mingw-w64-i686-pkg-config-0.29.2-3-any.pkg.tar.zst.
3>-- Using cached msys-mingw-w64-i686-libwinpthread-git-9.0.0.6373.5be8fcd83-1-any.pkg.tar.zst.
3>-- Using msys root at C:/Src/MMO/mqnext/contrib/vcpkg/downloads/tools/msys2/9a1ec3f33446b195
3>-- Fixing pkgconfig file: C:/Src/MMO/mqnext/contrib/vcpkg/packages/protobuf_x64-windows-static/debug/lib/pkgconfig/protobuf-lite.pc
3>-- Fixing pkgconfig file: C:/Src/MMO/mqnext/contrib/vcpkg/packages/protobuf_x64-windows-static/debug/lib/pkgconfig/protobuf.pc
3>-- Installing: C:/Src/MMO/mqnext/contrib/vcpkg/packages/protobuf_x64-windows-static/share/protobuf/copyright
3>-- Performing post-build validation
3>-- Performing post-build validation done
3>Stored binary cache: C:\Users\htwmm\AppData\Local\vcpkg\archives\57\57a555543e8da25a591cc6c4a3f96c7e9d0dbc38f9e744f865909f443d40f159.zip
3>Installing package protobuf[core]:x64-windows-static...
3>Elapsed time for package protobuf:x64-windows-static: 1.315 min
3>Starting package 3/3: rapidjson:x64-windows-static
3>Building package rapidjson[core]:x64-windows-static...
3>-- Downloading https://github.com/Tencent/rapidjson/archive/ce81bc9edfe773667a7a4454ba81dac72ed4364c.tar.gz -> Tencent-rapidjson-ce81bc9edfe773667a7a4454ba81dac72ed4364c.tar.gz...
3>-- Extracting source C:/Src/MMO/mqnext/contrib/vcpkg/downloads/Tencent-rapidjson-ce81bc9edfe773667a7a4454ba81dac72ed4364c.tar.gz
3>-- Using source at C:/Src/MMO/mqnext/contrib/vcpkg/buildtrees/rapidjson/src/c72ed4364c-35829b36f2.clean
3>-- Found external ninja('1.10.2').
3>-- Configuring x64-windows-static
3>-- Building x64-windows-static-dbg
3>-- Building x64-windows-static-rel
3>-- Installing: C:/Src/MMO/mqnext/contrib/vcpkg/packages/rapidjson_x64-windows-static/share/rapidjson/copyright
3>-- Performing post-build validation
3>-- Performing post-build validation done
3>Stored binary cache: C:\Users\htwmm\AppData\Local\vcpkg\archives\70\70c3113129990a0d003ee046d900ad3501849223be676187629f2ca58fd7be78.zip
3>Installing package rapidjson[core]:x64-windows-static...
3>Elapsed time for package rapidjson:x64-windows-static: 4.436 s
3>
3>Total elapsed time: 2.816 min
3>
3>The package protobuf provides CMake targets:
3>
3>    find_package(protobuf CONFIG REQUIRED)
3>    target_link_libraries(main PRIVATE protobuf::libprotoc protobuf::libprotobuf protobuf::libprotobuf-lite)
3>
3>The package rapidjson provides CMake targets:
3>
3>    find_package(RapidJSON CONFIG REQUIRED)
3>    target_link_libraries(main PRIVATE rapidjson)
3>
3>FindPattern.cpp
3>JsonProto.cpp
3>NavMesh.cpp
3>NavMeshData.cpp
3>Utilities.cpp
3>ZoneData.cpp
3>NavMeshFile.pb.cc
3>MQ2Nav_Common.vcxproj -> C:\Src\MMO\mqnext\build\lib\x64\release\MQ2Nav_Common.lib
6>------ Build started: Project: MQ2Nav_ConsoleTool, Configuration: Release x64 ------
7>------ Build started: Project: MQ2Nav, Configuration: Release x64 ------
8>------ Build started: Project: MQ2Nav_MeshGenerator, Configuration: Release x64 ------
7>Checking vcpkg_mq manifest for MQ2Nav...
6>Checking vcpkg_mq manifest for MQ2Nav_ConsoleTool...
8>Checking vcpkg_mq manifest for MeshGenerator...
6>MQ2Nav_ConsoleTool checking vcpkgs from C:\Src\MMO\mqnext\plugins\MQ2Nav\cli\vcpkg_mq.txt
6>Computing installation plan...
6>The following packages will be built and installed:
6>    sdl2[core]:x64-windows-static -> 2.0.20#2
6>Detecting compiler hash for triplet x64-windows-static...
6>Restored 0 packages from C:\Users\htwmm\AppData\Local\vcpkg\archives in 109.1 us. Use --debug to see more details.
6>Starting package 1/1: sdl2:x64-windows-static
6>Building package sdl2[core]:x64-windows-static...
6>-- Downloading https://github.com/libsdl-org/SDL/archive/release-2.0.20.tar.gz -> libsdl-org-SDL-release-2.0.20.tar.gz...
8>MeshGenerator checking vcpkgs from C:\Src\MMO\mqnext\plugins\MQ2Nav\meshgen\vcpkg_mq.txt
8>MeshGenerator waiting for another vcpkg.exe process to complete...
6>-- Extracting source C:/Src/MMO/mqnext/contrib/vcpkg/downloads/libsdl-org-SDL-release-2.0.20.tar.gz
6>-- Applying patch 0001-sdl2-Enable-creation-of-pkg-cfg-file-on-windows.patch
6>-- Applying patch 0002-sdl2-skip-ibus-on-linux.patch
6>-- Applying patch 0003-sdl2-disable-sdlmain-target-search-on-uwp.patch
6>-- Applying patch 0004-Define-crt-macros.patch
6>-- Applying patch 0005-Fix-uwp-joystick.patch
6>-- Applying patch 0006-Update-SDL_sysurl.cpp.patch
6>-- Applying patch 0007-timer-Fix-Emscripten-declaration-after-statement-err.patch
6>-- Using source at C:/Src/MMO/mqnext/contrib/vcpkg/buildtrees/sdl2/src/ase-2.0.20-870b37d4f3.clean
6>-- Found external ninja('1.10.2').
6>-- Configuring x64-windows-static
1>MQ2EasyFind waiting for another vcpkg.exe process to complete...
7>MQ2Nav checking vcpkgs from C:\Src\MMO\mqnext\plugins\MQ2Nav\plugin\vcpkg_mq.txt
7>Updating version resource...
6>-- Building x64-windows-static-dbg
6>-- Building x64-windows-static-rel
6>-- Fixing pkgconfig file: C:/Src/MMO/mqnext/contrib/vcpkg/packages/sdl2_x64-windows-static/lib/pkgconfig/sdl2.pc
6>-- Using cached msys-mingw-w64-i686-pkg-config-0.29.2-3-any.pkg.tar.zst.
6>-- Using cached msys-mingw-w64-i686-libwinpthread-git-9.0.0.6373.5be8fcd83-1-any.pkg.tar.zst.
6>-- Using msys root at C:/Src/MMO/mqnext/contrib/vcpkg/downloads/tools/msys2/9a1ec3f33446b195
6>-- Fixing pkgconfig file: C:/Src/MMO/mqnext/contrib/vcpkg/packages/sdl2_x64-windows-static/debug/lib/pkgconfig/sdl2.pc
6>-- Installing: C:/Src/MMO/mqnext/contrib/vcpkg/packages/sdl2_x64-windows-static/share/sdl2/copyright
6>-- Performing post-build validation
6>-- Performing post-build validation done
6>Stored binary cache: C:\Users\htwmm\AppData\Local\vcpkg\archives\3b\3b3fe8ab470509026a7681325cffd529debd664656eadaf30b27c4f41df1ea52.zip
6>Installing package sdl2[core]:x64-windows-static...
6>Elapsed time for package sdl2:x64-windows-static: 35.79 s
6>
6>Total elapsed time: 38.86 s
6>
6>The package sdl2 provides CMake targets:
6>
6>    find_package(SDL2 CONFIG REQUIRED)
6>    target_link_libraries(main PRIVATE SDL2::SDL2 SDL2::SDL2main SDL2::SDL2-static)
6>
8>Computing installation plan...
8>The following packages are already installed:
8>    sdl2[core]:x64-windows-static -> 2.0.20#2
8>Package sdl2:x64-windows-static is already installed
8>Restored 0 packages from C:\Users\htwmm\AppData\Local\vcpkg\archives in 78.9 us. Use --debug to see more details.
8>
8>Total elapsed time: 31.7 ms
8>
8>The package sdl2 provides CMake targets:
8>
8>    find_package(SDL2 CONFIG REQUIRED)
8>    target_link_libraries(main PRIVATE SDL2::SDL2 SDL2::SDL2main SDL2::SDL2-static)
8>
7>pch.cpp
8>pch.cpp
6>Main.cpp
7>Building Precompiled Header for MQ2Nav
8>ChunkyTriMesh.cpp
8>ConvexVolumeTool.cpp
8>EQConfig.cpp
8>DebugDraw.cpp
8>Application.cpp
8>ImGuiWidgets.cpp
8>imgui_impl_opengl2.cpp
8>imgui_impl_sdl.cpp
8>InputGeom.cpp
8>Main.cpp
8>MapGeometryLoader.cpp
8>NavMeshInfoTool.cpp
8>NavMeshTool.cpp
8>NavMeshPruneTool.cpp
8>NavMeshTesterTool.cpp
8>NavMeshTileTool.cpp
8>OffMeshConnectionTool.cpp
8>WaypointsTool.cpp
8>ZonePicker.cpp
7>SwitchHandler.cpp
7>KeybindHandler.cpp
7>MapAPI.cpp
7>ModelLoader.cpp
7>MQ2Navigation.cpp
7>PluginSettings.cpp
7>NavigationPath.cpp
7>NavigationType.cpp
7>NavMeshLoader.cpp
7>NavMeshRenderer.cpp
7>PluginMain.cpp
7>RenderHandler.cpp
7>RenderList.cpp
7>UiController.cpp
7>Waypoints.cpp
6>libprotobuf.lib(utility.cc.obj) : error LNK2001: unresolved external symbol __std_init_once_link_alternate_names_and_abort
6>libprotobuf.lib(any.cc.obj) : error LNK2001: unresolved external symbol __std_init_once_link_alternate_names_and_abort
6>libprotobuf.lib(map_field.cc.obj) : error LNK2001: unresolved external symbol __std_init_once_link_alternate_names_and_abort
6>libprotobuf.lib(reflection_ops.cc.obj) : error LNK2001: unresolved external symbol __std_init_once_link_alternate_names_and_abort
6>libprotobuf.lib(text_format.cc.obj) : error LNK2001: unresolved external symbol __std_init_once_link_alternate_names_and_abort
6>libprotobuf.lib(dynamic_message.cc.obj) : error LNK2001: unresolved external symbol __std_init_once_link_alternate_names_and_abort
6>libprotobuf.lib(protostream_objectsource.cc.obj) : error LNK2001: unresolved external symbol __std_init_once_link_alternate_names_and_abort
6>libprotobuf.lib(protostream_objectwriter.cc.obj) : error LNK2001: unresolved external symbol __std_init_once_link_alternate_names_and_abort
6>libprotobuf.lib(type_resolver_util.cc.obj) : error LNK2001: unresolved external symbol __std_init_once_link_alternate_names_and_abort
6>libprotobuf.lib(extension_set_heavy.cc.obj) : error LNK2001: unresolved external symbol __std_init_once_link_alternate_names_and_abort
6>libprotobuf.lib(wire_format.cc.obj) : error LNK2001: unresolved external symbol __std_init_once_link_alternate_names_and_abort
6>libprotobuf.lib(message.cc.obj) : error LNK2001: unresolved external symbol __std_init_once_link_alternate_names_and_abort
6>libprotobuf.lib(implicit_weak_message.cc.obj) : error LNK2001: unresolved external symbol __std_init_once_link_alternate_names_and_abort
6>libprotobuf.lib(descriptor.cc.obj) : error LNK2001: unresolved external symbol __std_init_once_link_alternate_names_and_abort
6>libprotobuf.lib(arenastring.cc.obj) : error LNK2001: unresolved external symbol __std_init_once_link_alternate_names_and_abort
6>libprotobuf.lib(message_lite.cc.obj) : error LNK2001: unresolved external symbol __std_init_once_link_alternate_names_and_abort
6>libprotobuf.lib(json_util.cc.obj) : error LNK2001: unresolved external symbol __std_init_once_link_alternate_names_and_abort
6>libprotobuf.lib(generated_message_reflection.cc.obj) : error LNK2001: unresolved external symbol __std_init_once_link_alternate_names_and_abort
6>C:\Src\MMO\mqnext\src\..\build\bin\release\MeshTool.exe : fatal error LNK1120: 1 unresolved externals
6>Done building project "MQ2Nav_ConsoleTool.vcxproj" -- FAILED.
8>libprotobuf.lib(utility.cc.obj) : error LNK2001: unresolved external symbol __std_init_once_link_alternate_names_and_abort
8>libprotobuf.lib(any.cc.obj) : error LNK2001: unresolved external symbol __std_init_once_link_alternate_names_and_abort
8>libprotobuf.lib(map_field.cc.obj) : error LNK2001: unresolved external symbol __std_init_once_link_alternate_names_and_abort
8>libprotobuf.lib(reflection_ops.cc.obj) : error LNK2001: unresolved external symbol __std_init_once_link_alternate_names_and_abort
8>libprotobuf.lib(text_format.cc.obj) : error LNK2001: unresolved external symbol __std_init_once_link_alternate_names_and_abort
8>libprotobuf.lib(dynamic_message.cc.obj) : error LNK2001: unresolved external symbol __std_init_once_link_alternate_names_and_abort
8>libprotobuf.lib(protostream_objectsource.cc.obj) : error LNK2001: unresolved external symbol __std_init_once_link_alternate_names_and_abort
8>libprotobuf.lib(protostream_objectwriter.cc.obj) : error LNK2001: unresolved external symbol __std_init_once_link_alternate_names_and_abort
8>libprotobuf.lib(type_resolver_util.cc.obj) : error LNK2001: unresolved external symbol __std_init_once_link_alternate_names_and_abort
8>libprotobuf.lib(extension_set_heavy.cc.obj) : error LNK2001: unresolved external symbol __std_init_once_link_alternate_names_and_abort
8>libprotobuf.lib(wire_format.cc.obj) : error LNK2001: unresolved external symbol __std_init_once_link_alternate_names_and_abort
8>libprotobuf.lib(message.cc.obj) : error LNK2001: unresolved external symbol __std_init_once_link_alternate_names_and_abort
8>libprotobuf.lib(implicit_weak_message.cc.obj) : error LNK2001: unresolved external symbol __std_init_once_link_alternate_names_and_abort
8>libprotobuf.lib(descriptor.cc.obj) : error LNK2001: unresolved external symbol __std_init_once_link_alternate_names_and_abort
8>libprotobuf.lib(arenastring.cc.obj) : error LNK2001: unresolved external symbol __std_init_once_link_alternate_names_and_abort
8>libprotobuf.lib(message_lite.cc.obj) : error LNK2001: unresolved external symbol __std_init_once_link_alternate_names_and_abort
8>libprotobuf.lib(json_util.cc.obj) : error LNK2001: unresolved external symbol __std_init_once_link_alternate_names_and_abort
8>libprotobuf.lib(generated_message_reflection.cc.obj) : error LNK2001: unresolved external symbol __std_init_once_link_alternate_names_and_abort
8>C:\Src\MMO\mqnext\src\..\build\bin\release\MeshGenerator.exe : fatal error LNK1120: 1 unresolved externals
8>Done building project "MeshGenerator.vcxproj" -- FAILED.
1>Computing installation plan...
7>   Creating library C:\Src\MMO\mqnext\src\..\build\bin\release\plugins\MQ2Nav.lib and object C:\Src\MMO\mqnext\src\..\build\bin\release\plugins\MQ2Nav.exp
1>The following packages will be built and installed:
1>    luajit[core]:x64-windows-static -> 2.0.5#5
1>    sol2[core]:x64-windows-static -> 3.2.2#2
1>    yaml-cpp[core]:x64-windows-static -> 0.7.0#1
7>libprotobuf.lib(utility.cc.obj) : error LNK2001: unresolved external symbol __std_init_once_link_alternate_names_and_abort
7>libprotobuf.lib(any.cc.obj) : error LNK2001: unresolved external symbol __std_init_once_link_alternate_names_and_abort
7>libprotobuf.lib(map_field.cc.obj) : error LNK2001: unresolved external symbol __std_init_once_link_alternate_names_and_abort
7>libprotobuf.lib(reflection_ops.cc.obj) : error LNK2001: unresolved external symbol __std_init_once_link_alternate_names_and_abort
7>libprotobuf.lib(text_format.cc.obj) : error LNK2001: unresolved external symbol __std_init_once_link_alternate_names_and_abort
7>libprotobuf.lib(dynamic_message.cc.obj) : error LNK2001: unresolved external symbol __std_init_once_link_alternate_names_and_abort
7>libprotobuf.lib(protostream_objectsource.cc.obj) : error LNK2001: unresolved external symbol __std_init_once_link_alternate_names_and_abort
7>libprotobuf.lib(protostream_objectwriter.cc.obj) : error LNK2001: unresolved external symbol __std_init_once_link_alternate_names_and_abort
7>libprotobuf.lib(type_resolver_util.cc.obj) : error LNK2001: unresolved external symbol __std_init_once_link_alternate_names_and_abort
7>libprotobuf.lib(extension_set_heavy.cc.obj) : error LNK2001: unresolved external symbol __std_init_once_link_alternate_names_and_abort
7>libprotobuf.lib(wire_format.cc.obj) : error LNK2001: unresolved external symbol __std_init_once_link_alternate_names_and_abort
7>libprotobuf.lib(message.cc.obj) : error LNK2001: unresolved external symbol __std_init_once_link_alternate_names_and_abort
7>libprotobuf.lib(implicit_weak_message.cc.obj) : error LNK2001: unresolved external symbol __std_init_once_link_alternate_names_and_abort
7>libprotobuf.lib(descriptor.cc.obj) : error LNK2001: unresolved external symbol __std_init_once_link_alternate_names_and_abort
7>libprotobuf.lib(arenastring.cc.obj) : error LNK2001: unresolved external symbol __std_init_once_link_alternate_names_and_abort
7>libprotobuf.lib(message_lite.cc.obj) : error LNK2001: unresolved external symbol __std_init_once_link_alternate_names_and_abort
7>libprotobuf.lib(json_util.cc.obj) : error LNK2001: unresolved external symbol __std_init_once_link_alternate_names_and_abort
7>libprotobuf.lib(generated_message_reflection.cc.obj) : error LNK2001: unresolved external symbol __std_init_once_link_alternate_names_and_abort
7>C:\Src\MMO\mqnext\src\..\build\bin\release\plugins\MQ2Nav.dll : fatal error LNK1120: 1 unresolved externals
7>Done building project "MQ2Nav.vcxproj" -- FAILED.
1>Detecting compiler hash for triplet x64-windows-static...
1>Restored 0 packages from C:\Users\htwmm\AppData\Local\vcpkg\archives in 174.4 us. Use --debug to see more details.
1>Starting package 1/3: luajit:x64-windows-static
1>Building package luajit[core]:x64-windows-static...
1>-- Downloading https://github.com/LuaJIT/LuaJIT/archive/v2.0.5.tar.gz -> LuaJIT-LuaJIT-v2.0.5.tar.gz...
1>-- Extracting source C:/Src/MMO/mqnext/contrib/vcpkg/downloads/LuaJIT-LuaJIT-v2.0.5.tar.gz
1>-- Applying patch 001-fix-build-path.patch
1>-- Applying patch 002-fix-crt-linkage.patch
1>-- Applying patch 003-debug-release-options.patch
1>-- Using source at C:/Src/MMO/mqnext/contrib/vcpkg/buildtrees/luajit/src/v2.0.5-a78633d7f2.clean
1>-- Building x64-windows-static-dbg
1>-- Installing: C:/Src/MMO/mqnext/contrib/vcpkg/packages/luajit_x64-windows-static/debug/tools/luajit.exe
1>-- Installing: C:/Src/MMO/mqnext/contrib/vcpkg/packages/luajit_x64-windows-static/debug/lib/lua51.lib
1>-- Building x64-windows-static-rel
1>CMake Warning at scripts/cmake/vcpkg_execute_required_process_repeat.cmake:26 (message):
1>  vcpkg_execute_required_process_repeat was passed extra arguments: d8un
1>Call Stack (most recent call first):
1>  ports/luajit/portfile.cmake:47 (vcpkg_execute_required_process_repeat)
1>  scripts/ports.cmake:145 (include)
1>
1>
1>-- Installing: C:/Src/MMO/mqnext/contrib/vcpkg/packages/luajit_x64-windows-static/tools/luajit.exe
1>-- Installing: C:/Src/MMO/mqnext/contrib/vcpkg/packages/luajit_x64-windows-static/lib/lua51.lib
1>-- Installing: C:/Src/MMO/mqnext/contrib/vcpkg/packages/luajit_x64-windows-static/include/luajit/lua.h
1>-- Installing: C:/Src/MMO/mqnext/contrib/vcpkg/packages/luajit_x64-windows-static/include/luajit/luajit.h
1>-- Installing: C:/Src/MMO/mqnext/contrib/vcpkg/packages/luajit_x64-windows-static/include/luajit/luaconf.h
1>-- Installing: C:/Src/MMO/mqnext/contrib/vcpkg/packages/luajit_x64-windows-static/include/luajit/lualib.h
1>-- Installing: C:/Src/MMO/mqnext/contrib/vcpkg/packages/luajit_x64-windows-static/include/luajit/lauxlib.h
1>-- Installing: C:/Src/MMO/mqnext/contrib/vcpkg/packages/luajit_x64-windows-static/include/luajit/lua.hpp
1>-- Performing post-build validation
1>-- Performing post-build validation done
1>Stored binary cache: C:\Users\htwmm\AppData\Local\vcpkg\archives\ec\ec71ec2ae229bc6bb643b6279d075bbe696da0485dbdf4a3ddc235323c6cc718.zip
1>Installing package luajit[core]:x64-windows-static...
1>Elapsed time for package luajit:x64-windows-static: 25.22 s
1>Starting package 2/3: sol2:x64-windows-static
1>Building package sol2[core]:x64-windows-static...
1>-- Downloading https://github.com/ThePhD/sol2/archive/v3.2.2.tar.gz -> ThePhD-sol2-v3.2.2.tar.gz...
1>-- Extracting source C:/Src/MMO/mqnext/contrib/vcpkg/downloads/ThePhD-sol2-v3.2.2.tar.gz
1>-- Applying patch fix-namespace.patch
1>-- Using source at C:/Src/MMO/mqnext/contrib/vcpkg/buildtrees/sol2/src/v3.2.2-69d2eb8eb0.clean
1>-- Found external ninja('1.10.2').
1>-- Configuring x64-windows-static
1>-- Building x64-windows-static-dbg
1>-- Building x64-windows-static-rel
1>-- Installing: C:/Src/MMO/mqnext/contrib/vcpkg/packages/sol2_x64-windows-static/include//sol
1>-- Installing: C:/Src/MMO/mqnext/contrib/vcpkg/packages/sol2_x64-windows-static/include//sol/config.hpp
1>-- Installing: C:/Src/MMO/mqnext/contrib/vcpkg/packages/sol2_x64-windows-static/include//sol/forward.hpp
1>-- Installing: C:/Src/MMO/mqnext/contrib/vcpkg/packages/sol2_x64-windows-static/include//sol/sol.hpp
1>-- Installing: C:/Src/MMO/mqnext/contrib/vcpkg/packages/sol2_x64-windows-static/share/sol2/copyright
1>-- Using cached msys-mingw-w64-i686-pkg-config-0.29.2-3-any.pkg.tar.zst.
1>-- Using cached msys-mingw-w64-i686-libwinpthread-git-9.0.0.6373.5be8fcd83-1-any.pkg.tar.zst.
1>-- Using msys root at C:/Src/MMO/mqnext/contrib/vcpkg/downloads/tools/msys2/9a1ec3f33446b195
1>-- Performing post-build validation
1>-- Performing post-build validation done
1>Stored binary cache: C:\Users\htwmm\AppData\Local\vcpkg\archives\f8\f8546f0a0a9759e057e6bab310586ec447ba470d23e9aed9639817abccc889b1.zip
1>Installing package sol2[core]:x64-windows-static...
1>Elapsed time for package sol2:x64-windows-static: 5.915 s
1>Starting package 3/3: yaml-cpp:x64-windows-static
1>Building package yaml-cpp[core]:x64-windows-static...
1>-- Downloading https://github.com/jbeder/yaml-cpp/archive/0579ae3d976091d7d664aa9d2527e0d0cff25763.tar.gz -> jbeder-yaml-cpp-0579ae3d976091d7d664aa9d2527e0d0cff25763.tar.gz...
1>-- Extracting source C:/Src/MMO/mqnext/contrib/vcpkg/downloads/jbeder-yaml-cpp-0579ae3d976091d7d664aa9d2527e0d0cff25763.tar.gz
1>-- Using source at C:/Src/MMO/mqnext/contrib/vcpkg/buildtrees/yaml-cpp/src/d0cff25763-31738b4ebd.clean
1>-- Found external ninja('1.10.2').
1>-- Configuring x64-windows-static
1>-- Building x64-windows-static-dbg
1>-- Building x64-windows-static-rel
1>-- Fixing pkgconfig file: C:/Src/MMO/mqnext/contrib/vcpkg/packages/yaml-cpp_x64-windows-static/lib/pkgconfig/yaml-cpp.pc
1>-- Using cached msys-mingw-w64-i686-pkg-config-0.29.2-3-any.pkg.tar.zst.
1>-- Using cached msys-mingw-w64-i686-libwinpthread-git-9.0.0.6373.5be8fcd83-1-any.pkg.tar.zst.
1>-- Using msys root at C:/Src/MMO/mqnext/contrib/vcpkg/downloads/tools/msys2/9a1ec3f33446b195
1>-- Fixing pkgconfig file: C:/Src/MMO/mqnext/contrib/vcpkg/packages/yaml-cpp_x64-windows-static/debug/lib/pkgconfig/yaml-cpp.pc
1>-- Installing: C:/Src/MMO/mqnext/contrib/vcpkg/packages/yaml-cpp_x64-windows-static/share/yaml-cpp/copyright
1>-- Performing post-build validation
1>-- Performing post-build validation done
1>Stored binary cache: C:\Users\htwmm\AppData\Local\vcpkg\archives\c0\c0b1c03fc4c5e775f716ccbf6a60e0b1769fe06646ad9a0df6f8cec28622ca98.zip
1>Installing package yaml-cpp[core]:x64-windows-static...
1>Elapsed time for package yaml-cpp:x64-windows-static: 13.86 s
1>
1>Total elapsed time: 48.28 s
1>
1>The package sol2 provides CMake targets:
1>
1>    find_package(sol2 CONFIG REQUIRED)
1>    target_link_libraries(main PRIVATE sol2::sol2)
1>
1>The package yaml-cpp provides CMake targets:
1>
1>    find_package(yaml-cpp CONFIG REQUIRED)
1>    target_link_libraries(main PRIVATE yaml-cpp)
1>
1>AssemblyFunctions64.asm
1>EasyFind.cpp
1>EasyFindConfiguration.cpp
1>EasyFindImGui.cpp
1>EasyFindNavigation.cpp
1>EasyFindWindow.cpp
1>EasyFindZoneConnections.cpp
1>EasyFindZonePath.cpp
1>   Creating library C:\Src\MMO\mqnext\src\..\build\bin\release\plugins\MQ2EasyFind.lib and object C:\Src\MMO\mqnext\src\..\build\bin\release\plugins\MQ2EasyFind.exp
1>MQ2EasyFind.vcxproj -> C:\Src\MMO\mqnext\build\bin\release\plugins\MQ2EasyFind.dll
========== Build: 5 succeeded, 3 failed, 1 up-to-date, 0 skipped ==========

Comments