shadowm icon

Untitled

shadowm | PRO | 11/06/16 12:35:50 AM UTC | 0 ⭐ | 376 👁️ | Never ⏰ | []
text |

2.77 KB

|

None

|

0 👍

/

0 👎

.................................................................................................................................................error: data/gui-2/default/window/lobby_main.cfg:810: End of WML file reached, but some tags were not properly closed.
(nearest unclosed tag is: [column])
..error: data/gui-2/default/window/lobby_main.cfg:810: End of WML file reached, but some tags were not properly closed.
(nearest unclosed tag is: [column]).
......error: data/gui-2/default/window/lobby_main.cfg:810: End of WML file reached, but some tags were not properly closed.
(nearest unclosed tag is: [column])
.............error: data/gui-2/default/window/lobby_main.cfg:810: End of WML file reached, but some tags were not properly closed.
(nearest unclosed tag is: [column]).
...................................error: data/gui-2/default/window/lobby_main.cfg:810: End of WML file reached, but some tags were not properly closed.
(nearest unclosed tag is: [column])
po/CMakeFiles/pot-update.dir/build.make:9357: recipe for target '../po/wesnoth-editor/wesnoth-editor.wml.pot' failed
make[3]: *** [../po/wesnoth-editor/wesnoth-editor.wml.pot] Error 1
make[3]: *** Waiting for unfinished jobs....
po/CMakeFiles/pot-update.dir/build.make:9303: recipe for target '../po/wesnoth-ai/wesnoth-ai.wml.pot' failed
make[3]: *** [../po/wesnoth-ai/wesnoth-ai.wml.pot] Error 1
po/CMakeFiles/pot-update.dir/build.make:9375: recipe for target '../po/wesnoth-help/wesnoth-help.wml.pot' failed
make[3]: *** [../po/wesnoth-help/wesnoth-help.wml.pot] Error 1
po/CMakeFiles/pot-update.dir/build.make:9294: recipe for target '../po/wesnoth/wesnoth.wml.pot' failed
make[3]: *** [../po/wesnoth/wesnoth.wml.pot] Error 1
po/CMakeFiles/pot-update.dir/build.make:9402: recipe for target '../po/wesnoth-lib/wesnoth-lib.wml.pot' failed
make[3]: *** [../po/wesnoth-lib/wesnoth-lib.wml.pot] Error 1
 done.
............................................................................................................................................................................................................... done.
................................................................................................................................................................................................................. done.
CMakeFiles/Makefile2:1597: recipe for target 'po/CMakeFiles/pot-update.dir/all' failed
make[2]: *** [po/CMakeFiles/pot-update.dir/all] Error 2
CMakeFiles/Makefile2:1604: recipe for target 'po/CMakeFiles/pot-update.dir/rule' failed
make[1]: *** [po/CMakeFiles/pot-update.dir/rule] Error 2
Makefile:717: recipe for target 'pot-update' failed
make: *** [pot-update] Error 2
21:34:25 shadowm@nanacore git:master ~/src/wesnoth % readlink -e =wmlxgettext
/home/shadowm/src/wesnoth/utils/wmlxgettext

Comments