digitalcustodians icon

Dollarydoos CentOS 6.7 Make errors 001

digitalcustodians | PRO | 10/23/17 07:53:13 AM UTC | 0 ⭐ | 7760 👁️ | Never ⏰ | []
Make |

2.07 KB

|

None

|

0 👍

/

0 👎

root@hydrogen [/var/git/dollarydoos]# make
mkdir -p build/release
cd build/release && cmake -D CMAKE_BUILD_TYPE=Release ../..
-- Boost version: 1.59.0
-- Found the following Boost libraries:
--   system
--   filesystem
--   thread
--   date_time
--   chrono
--   regex
--   serialization
--   program_options
-- Found Git: /usr/local/bin/git
-- Could NOT find Threads (missing:  Threads_FOUND)
-- Configuring done
-- Generating done
-- Build files have been written to: /var/git/dollarydoos/build/release
cd build/release && make
make[1]: Entering directory `/var/git/dollarydoos/build/release'
make[2]: Entering directory `/var/git/dollarydoos/build/release'
make[3]: Entering directory `/var/git/dollarydoos/build/release'
Scanning dependencies of target version
make[3]: Leaving directory `/var/git/dollarydoos/build/release'
make[3]: Entering directory `/var/git/dollarydoos/build/release'
make[3]: Leaving directory `/var/git/dollarydoos/build/release'
[  0%] Built target version
make[3]: Entering directory `/var/git/dollarydoos/build/release'
Scanning dependencies of target upnpc-static
make[3]: Leaving directory `/var/git/dollarydoos/build/release'
make[3]: Entering directory `/var/git/dollarydoos/build/release'
[  0%] Building C object external/miniupnpc/CMakeFiles/upnpc-static.dir/igd_desc_parse.c.o
cc1: error: invalid option argument ‘-Ofast’
cc1: error: -Werror=unused-result: No option -Wunused-result
cc1: error: -Werror=maybe-uninitialized: No option -Wmaybe-uninitialized
cc1: error: unrecognized command line option "-std=c11"
cc1: warnings being treated as errors
cc1: error: unrecognized command line option "-Wno-unused-result"
make[3]: *** [external/miniupnpc/CMakeFiles/upnpc-static.dir/igd_desc_parse.c.o] Error 1
make[3]: Leaving directory `/var/git/dollarydoos/build/release'
make[2]: *** [external/miniupnpc/CMakeFiles/upnpc-static.dir/all] Error 2
make[2]: Leaving directory `/var/git/dollarydoos/build/release'
make[1]: *** [all] Error 2
make[1]: Leaving directory `/var/git/dollarydoos/build/release'
make: *** [build-release] Error 2

Comments

  •  icon
    01/01/70 12:00:00 AM UTC
    Plain Text |

    0 B

    |

    👍

    /

    👎

    
        
  •  icon
    01/01/70 12:00:00 AM UTC
    Plain Text |

    0 B

    |

    👍

    /

    👎