Build started...
1>------ Build started: Project: MacroQuest, Configuration: Release x64 ------
1>Checking vcpkg_mq manifest for MacroQuest...
1>MacroQuest checking vcpkgs from C:\Src\MMO\mqnext\src\loader\vcpkg_mq.txt
1>libcurl.lib(openssl.c.obj) : error LNK2001: unresolved external symbol OPENSSL_sk_num
1>libcurl.lib(openssl.c.obj) : error LNK2001: unresolved external symbol OPENSSL_sk_value
1>libcurl.lib(openssl.c.obj) : error LNK2001: unresolved external symbol OPENSSL_sk_pop_free
1>libcurl.lib(openssl.c.obj) : error LNK2001: unresolved external symbol OPENSSL_sk_pop
1>libcurl.lib(openssl.c.obj) : error LNK2001: unresolved external symbol OpenSSL_version
1>libcurl.lib(openssl.c.obj) : error LNK2001: unresolved external symbol CRYPTO_get_ex_new_index
1>libcurl.lib(openssl.c.obj) : error LNK2001: unresolved external symbol CRYPTO_malloc
1>libcurl.lib(openssl.c.obj) : error LNK2001: unresolved external symbol CRYPTO_free
1>libcurl.lib(openssl.c.obj) : error LNK2001: unresolved external symbol BIO_s_file
1>libcurl.lib(openssl.c.obj) : error LNK2001: unresolved external symbol BIO_new
1>libcurl.lib(openssl.c.obj) : error LNK2001: unresolved external symbol BIO_free
1>libcurl.lib(openssl.c.obj) : error LNK2001: unresolved external symbol BIO_puts
1>libcurl.lib(openssl.c.obj) : error LNK2001: unresolved external symbol BIO_ctrl
1>libcurl.lib(openssl.c.obj) : error LNK2001: unresolved external symbol BIO_s_mem
1>libcurl.lib(openssl.c.obj) : error LNK2001: unresolved external symbol BIO_new_mem_buf
1>libcurl.lib(openssl.c.obj) : error LNK2001: unresolved external symbol BIO_printf
1>libcurl.lib(openssl.c.obj) : error LNK2001: unresolved external symbol BN_num_bits
1>libcurl.lib(openssl.c.obj) : error LNK2001: unresolved external symbol BN_clear_free
1>libcurl.lib(openssl.c.obj) : error LNK2001: unresolved external symbol BN_print
1>libcurl.lib(openssl.c.obj) : error LNK2001: unresolved external symbol ASN1_STRING_length
1>libcurl.lib(openssl.c.obj) : error LNK2001: unresolved external symbol ASN1_STRING_type
1>libcurl.lib(openssl.c.obj) : error LNK2001: unresolved external symbol ASN1_STRING_get0_data
1>libcurl.lib(openssl.c.obj) : error LNK2001: unresolved external symbol i2a_ASN1_OBJECT
1>libcurl.lib(openssl.c.obj) : error LNK2001: unresolved external symbol i2t_ASN1_OBJECT
1>libcurl.lib(openssl.c.obj) : error LNK2001: unresolved external symbol ASN1_STRING_to_UTF8
1>libcurl.lib(openssl.c.obj) : error LNK2001: unresolved external symbol ASN1_TIME_print
1>libcurl.lib(openssl.c.obj) : error LNK2001: unresolved external symbol ASN1_STRING_print
1>libcurl.lib(openssl.c.obj) : error LNK2001: unresolved external symbol EVP_MD_CTX_new
1>libcurl.lib(sha256.c.obj) : error LNK2001: unresolved external symbol EVP_MD_CTX_new
1>libcurl.lib(openssl.c.obj) : error LNK2001: unresolved external symbol EVP_MD_CTX_free
1>libcurl.lib(sha256.c.obj) : error LNK2001: unresolved external symbol EVP_MD_CTX_free
1>libcurl.lib(openssl.c.obj) : error LNK2001: unresolved external symbol EVP_DigestUpdate
1>libcurl.lib(sha256.c.obj) : error LNK2001: unresolved external symbol EVP_DigestUpdate
1>libcurl.lib(openssl.c.obj) : error LNK2001: unresolved external symbol EVP_DigestFinal_ex
1>libcurl.lib(sha256.c.obj) : error LNK2001: unresolved external symbol EVP_DigestFinal_ex
1>libcurl.lib(openssl.c.obj) : error LNK2001: unresolved external symbol EVP_DigestInit
1>libcurl.lib(openssl.c.obj) : error LNK2001: unresolved external symbol EVP_sha1
1>libcurl.lib(openssl.c.obj) : error LNK2001: unresolved external symbol EVP_sha256
1>libcurl.lib(sha256.c.obj) : error LNK2001: unresolved external symbol EVP_sha256
1>libcurl.lib(openssl.c.obj) : error LNK2001: unresolved external symbol EVP_PKEY_get_id
1>libcurl.lib(openssl.c.obj) : error LNK2001: unresolved external symbol EVP_PKEY_get1_RSA
1>libcurl.lib(openssl.c.obj) : error LNK2001: unresolved external symbol EVP_PKEY_free
1>libcurl.lib(openssl.c.obj) : error LNK2001: unresolved external symbol EVP_PKEY_copy_parameters
1>libcurl.lib(openssl.c.obj) : error LNK2001: unresolved external symbol EVP_PKEY_get_bn_param
1>libcurl.lib(openssl.c.obj) : error LNK2001: unresolved external symbol RSA_free
1>libcurl.lib(openssl.c.obj) : error LNK2001: unresolved external symbol RSA_flags
1>libcurl.lib(openssl.c.obj) : error LNK2001: unresolved external symbol X509_STORE_set_flags
1>libcurl.lib(openssl.c.obj) : error LNK2001: unresolved external symbol X509_STORE_add_lookup
1>libcurl.lib(openssl.c.obj) : error LNK2001: unresolved external symbol X509_LOOKUP_file
1>libcurl.lib(openssl.c.obj) : error LNK2001: unresolved external symbol X509_STORE_add_cert
1>libcurl.lib(openssl.c.obj) : error LNK2001: unresolved external symbol X509_STORE_add_crl
1>libcurl.lib(openssl.c.obj) : error LNK2001: unresolved external symbol X509_load_crl_file
1>libcurl.lib(openssl.c.obj) : error LNK2001: unresolved external symbol X509_verify_cert_error_string
1>libcurl.lib(openssl.c.obj) : error LNK2001: unresolved external symbol GENERAL_NAMES_free
1>libcurl.lib(openssl.c.obj) : error LNK2001: unresolved external symbol X509V3_EXT_print
1>libcurl.lib(openssl.c.obj) : error LNK2001: unresolved external symbol X509_check_issued
1>libcurl.lib(openssl.c.obj) : error LNK2001: unresolved external symbol OCSP_cert_to_id
1>libcurl.lib(openssl.c.obj) : error LNK2001: unresolved external symbol OCSP_response_status
1>libcurl.lib(openssl.c.obj) : error LNK2001: unresolved external symbol OCSP_response_get1_basic
1>libcurl.lib(openssl.c.obj) : error LNK2001: unresolved external symbol OCSP_resp_find_status
1>libcurl.lib(openssl.c.obj) : error LNK2001: unresolved external symbol OCSP_check_validity
1>libcurl.lib(openssl.c.obj) : error LNK2001: unresolved external symbol OCSP_BASICRESP_free
1>libcurl.lib(openssl.c.obj) : error LNK2001: unresolved external symbol OCSP_RESPONSE_free
1>libcurl.lib(openssl.c.obj) : error LNK2001: unresolved external symbol d2i_OCSP_RESPONSE
1>libcurl.lib(openssl.c.obj) : error LNK2001: unresolved external symbol OCSP_CERTID_free
1>libcurl.lib(openssl.c.obj) : error LNK2001: unresolved external symbol OCSP_response_status_str
1>libcurl.lib(openssl.c.obj) : error LNK2001: unresolved external symbol OCSP_cert_status_str
1>libcurl.lib(openssl.c.obj) : error LNK2001: unresolved external symbol OCSP_crl_reason_str
1>libcurl.lib(openssl.c.obj) : error LNK2001: unresolved external symbol OCSP_basic_verify
1>libcurl.lib(openssl.c.obj) : error LNK2001: unresolved external symbol d2i_X509_bio
1>libcurl.lib(openssl.c.obj) : error LNK2001: unresolved external symbol d2i_PrivateKey_bio
1>libcurl.lib(openssl.c.obj) : error LNK2001: unresolved external symbol i2d_X509_PUBKEY
1>libcurl.lib(openssl.c.obj) : error LNK2001: unresolved external symbol X509_free
1>libcurl.lib(openssl.c.obj) : error LNK2001: unresolved external symbol d2i_X509
1>libcurl.lib(openssl.c.obj) : error LNK2001: unresolved external symbol X509_get0_signature
1>libcurl.lib(openssl.c.obj) : error LNK2001: unresolved external symbol X509_INFO_free
1>libcurl.lib(openssl.c.obj) : error LNK2001: unresolved external symbol X509_get_version
1>libcurl.lib(openssl.c.obj) : error LNK2001: unresolved external symbol X509_get_serialNumber
1>libcurl.lib(openssl.c.obj) : error LNK2001: unresolved external symbol X509_get_issuer_name
1>libcurl.lib(openssl.c.obj) : error LNK2001: unresolved external symbol X509_get_subject_name
1>libcurl.lib(openssl.c.obj) : error LNK2001: unresolved external symbol X509_get0_notBefore
1>libcurl.lib(openssl.c.obj) : error LNK2001: unresolved external symbol X509_get0_notAfter
1>libcurl.lib(openssl.c.obj) : error LNK2001: unresolved external symbol X509_get_X509_PUBKEY
1>libcurl.lib(openssl.c.obj) : error LNK2001: unresolved external symbol X509_get0_extensions
1>libcurl.lib(openssl.c.obj) : error LNK2001: unresolved external symbol X509_get_pubkey
1>libcurl.lib(openssl.c.obj) : error LNK2001: unresolved external symbol X509_NAME_print_ex
1>libcurl.lib(openssl.c.obj) : error LNK2001: unresolved external symbol X509_NAME_get_index_by_NID
1>libcurl.lib(openssl.c.obj) : error LNK2001: unresolved external symbol X509_NAME_get_entry
1>libcurl.lib(openssl.c.obj) : error LNK2001: unresolved external symbol X509_NAME_ENTRY_get_data
1>libcurl.lib(openssl.c.obj) : error LNK2001: unresolved external symbol X509_get_ext_d2i
1>libcurl.lib(openssl.c.obj) : error LNK2001: unresolved external symbol X509_EXTENSION_get_object
1>libcurl.lib(openssl.c.obj) : error LNK2001: unresolved external symbol X509_EXTENSION_get_data
1>libcurl.lib(openssl.c.obj) : error LNK2001: unresolved external symbol X509_PUBKEY_get0_param
1>libcurl.lib(openssl.c.obj) : error LNK2001: unresolved external symbol PEM_X509_INFO_read_bio
1>libcurl.lib(openssl.c.obj) : error LNK2001: unresolved external symbol PEM_read_bio_X509
1>libcurl.lib(openssl.c.obj) : error LNK2001: unresolved external symbol PEM_write_bio_X509
1>libcurl.lib(openssl.c.obj) : error LNK2001: unresolved external symbol PEM_read_bio_X509_AUX
1>libcurl.lib(openssl.c.obj) : error LNK2001: unresolved external symbol PEM_read_bio_PrivateKey
1>libcurl.lib(openssl.c.obj) : error LNK2001: unresolved external symbol SSL_CTX_set_options
1>libcurl.lib(openssl.c.obj) : error LNK2001: unresolved external symbol SSL_CTX_set_msg_callback
1>libcurl.lib(openssl.c.obj) : error LNK2001: unresolved external symbol SSL_CTX_sess_set_new_cb
1>libcurl.lib(openssl.c.obj) : error LNK2001: unresolved external symbol SSL_CTX_set_next_proto_select_cb
1>libcurl.lib(openssl.c.obj) : error LNK2001: unresolved external symbol SSL_CTX_set_alpn_protos
1>libcurl.lib(openssl.c.obj) : error LNK2001: unresolved external symbol SSL_get0_alpn_selected
1>libcurl.lib(openssl.c.obj) : error LNK2001: unresolved external symbol SSL_CTX_set_keylog_callback
1>libcurl.lib(openssl.c.obj) : error LNK2001: unresolved external symbol BIO_f_ssl
1>libcurl.lib(openssl.c.obj) : error LNK2001: unresolved external symbol SSL_CTX_set_cipher_list
1>libcurl.lib(openssl.c.obj) : error LNK2001: unresolved external symbol SSL_CTX_new
1>libcurl.lib(openssl.c.obj) : error LNK2001: unresolved external symbol SSL_CTX_free
1>libcurl.lib(openssl.c.obj) : error LNK2001: unresolved external symbol SSL_CTX_get_cert_store
1>libcurl.lib(openssl.c.obj) : error LNK2001: unresolved external symbol SSL_get_current_cipher
1>libcurl.lib(openssl.c.obj) : error LNK2001: unresolved external symbol SSL_CIPHER_get_name
1>libcurl.lib(openssl.c.obj) : error LNK2001: unresolved external symbol SSL_pending
1>libcurl.lib(openssl.c.obj) : error LNK2001: unresolved external symbol SSL_set_fd
1>libcurl.lib(openssl.c.obj) : error LNK2001: unresolved external symbol SSL_set_bio
1>libcurl.lib(openssl.c.obj) : error LNK2001: unresolved external symbol SSL_CTX_set_ciphersuites
1>libcurl.lib(openssl.c.obj) : error LNK2001: unresolved external symbol SSL_CTX_use_PrivateKey_file
1>libcurl.lib(openssl.c.obj) : error LNK2001: unresolved external symbol SSL_CTX_use_certificate_file
1>libcurl.lib(openssl.c.obj) : error LNK2001: unresolved external symbol SSL_CTX_use_certificate_chain_file
1>libcurl.lib(openssl.c.obj) : error LNK2001: unresolved external symbol SSL_SESSION_free
1>libcurl.lib(openssl.c.obj) : error LNK2001: unresolved external symbol SSL_set_session
1>libcurl.lib(openssl.c.obj) : error LNK2001: unresolved external symbol SSL_get1_peer_certificate
1>libcurl.lib(openssl.c.obj) : error LNK2001: unresolved external symbol SSL_get_peer_cert_chain
1>libcurl.lib(openssl.c.obj) : error LNK2001: unresolved external symbol SSL_CTX_set_verify
1>libcurl.lib(openssl.c.obj) : error LNK2001: unresolved external symbol SSL_CTX_use_PrivateKey
1>libcurl.lib(openssl.c.obj) : error LNK2001: unresolved external symbol SSL_CTX_use_certificate
1>libcurl.lib(openssl.c.obj) : error LNK2001: unresolved external symbol SSL_CTX_set_default_passwd_cb
1>libcurl.lib(openssl.c.obj) : error LNK2001: unresolved external symbol SSL_CTX_set_default_passwd_cb_userdata
1>libcurl.lib(openssl.c.obj) : error LNK2001: unresolved external symbol SSL_CTX_check_private_key
1>libcurl.lib(openssl.c.obj) : error LNK2001: unresolved external symbol SSL_new
1>libcurl.lib(openssl.c.obj) : error LNK2001: unresolved external symbol SSL_free
1>libcurl.lib(openssl.c.obj) : error LNK2001: unresolved external symbol SSL_connect
1>libcurl.lib(openssl.c.obj) : error LNK2001: unresolved external symbol SSL_read
1>libcurl.lib(openssl.c.obj) : error LNK2001: unresolved external symbol SSL_write
1>libcurl.lib(openssl.c.obj) : error LNK2001: unresolved external symbol SSL_ctrl
1>libcurl.lib(openssl.c.obj) : error LNK2001: unresolved external symbol SSL_CTX_ctrl
1>libcurl.lib(openssl.c.obj) : error LNK2001: unresolved external symbol SSL_get_error
1>libcurl.lib(openssl.c.obj) : error LNK2001: unresolved external symbol SSL_get_version
1>libcurl.lib(openssl.c.obj) : error LNK2001: unresolved external symbol TLS_client_method
1>libcurl.lib(openssl.c.obj) : error LNK2001: unresolved external symbol SSL_shutdown
1>libcurl.lib(openssl.c.obj) : error LNK2001: unresolved external symbol SSL_CTX_set_post_handshake_auth
1>libcurl.lib(openssl.c.obj) : error LNK2001: unresolved external symbol SSL_alert_desc_string_long
1>libcurl.lib(openssl.c.obj) : error LNK2001: unresolved external symbol SSL_CTX_add_client_CA
1>libcurl.lib(openssl.c.obj) : error LNK2001: unresolved external symbol SSL_set_connect_state
1>libcurl.lib(openssl.c.obj) : error LNK2001: unresolved external symbol SSL_get_certificate
1>libcurl.lib(openssl.c.obj) : error LNK2001: unresolved external symbol SSL_get_privatekey
1>libcurl.lib(openssl.c.obj) : error LNK2001: unresolved external symbol SSL_get_shutdown
1>libcurl.lib(openssl.c.obj) : error LNK2001: unresolved external symbol SSL_CTX_set_default_verify_paths
1>libcurl.lib(openssl.c.obj) : error LNK2001: unresolved external symbol SSL_CTX_load_verify_file
1>libcurl.lib(openssl.c.obj) : error LNK2001: unresolved external symbol SSL_CTX_load_verify_dir
1>libcurl.lib(openssl.c.obj) : error LNK2001: unresolved external symbol SSL_get_verify_result
1>libcurl.lib(openssl.c.obj) : error LNK2001: unresolved external symbol SSL_set_ex_data
1>libcurl.lib(openssl.c.obj) : error LNK2001: unresolved external symbol SSL_get_ex_data
1>libcurl.lib(openssl.c.obj) : error LNK2001: unresolved external symbol OPENSSL_init_ssl
1>libcurl.lib(openssl.c.obj) : error LNK2001: unresolved external symbol RAND_bytes
1>libcurl.lib(openssl.c.obj) : error LNK2001: unresolved external symbol RAND_status
1>libcurl.lib(openssl.c.obj) : error LNK2001: unresolved external symbol ERR_get_error
1>libcurl.lib(openssl.c.obj) : error LNK2001: unresolved external symbol ERR_peek_error
1>libcurl.lib(openssl.c.obj) : error LNK2001: unresolved external symbol ERR_peek_last_error
1>libcurl.lib(openssl.c.obj) : error LNK2001: unresolved external symbol ERR_clear_error
1>libcurl.lib(openssl.c.obj) : error LNK2001: unresolved external symbol ERR_error_string_n
1>libcurl.lib(openssl.c.obj) : error LNK2001: unresolved external symbol PKCS12_free
1>libcurl.lib(openssl.c.obj) : error LNK2001: unresolved external symbol PKCS12_PBE_add
1>libcurl.lib(openssl.c.obj) : error LNK2001: unresolved external symbol PKCS12_parse
1>libcurl.lib(openssl.c.obj) : error LNK2001: unresolved external symbol d2i_PKCS12_bio
1>libcurl.lib(openssl.c.obj) : error LNK2001: unresolved external symbol UI_get0_user_data
1>libcurl.lib(openssl.c.obj) : error LNK2001: unresolved external symbol UI_OpenSSL
1>libcurl.lib(openssl.c.obj) : error LNK2001: unresolved external symbol UI_create_method
1>libcurl.lib(openssl.c.obj) : error LNK2001: unresolved external symbol UI_destroy_method
1>libcurl.lib(openssl.c.obj) : error LNK2001: unresolved external symbol UI_method_set_opener
1>libcurl.lib(openssl.c.obj) : error LNK2001: unresolved external symbol UI_method_set_writer
1>libcurl.lib(openssl.c.obj) : error LNK2001: unresolved external symbol UI_method_set_reader
1>libcurl.lib(openssl.c.obj) : error LNK2001: unresolved external symbol UI_method_set_closer
1>libcurl.lib(openssl.c.obj) : error LNK2001: unresolved external symbol UI_method_get_opener
1>libcurl.lib(openssl.c.obj) : error LNK2001: unresolved external symbol UI_method_get_writer
1>libcurl.lib(openssl.c.obj) : error LNK2001: unresolved external symbol UI_method_get_reader
1>libcurl.lib(openssl.c.obj) : error LNK2001: unresolved external symbol UI_method_get_closer
1>libcurl.lib(openssl.c.obj) : error LNK2001: unresolved external symbol UI_get_string_type
1>libcurl.lib(openssl.c.obj) : error LNK2001: unresolved external symbol UI_get_input_flags
1>libcurl.lib(openssl.c.obj) : error LNK2001: unresolved external symbol UI_set_result
1>libcurl.lib(openssl.c.obj) : error LNK2001: unresolved external symbol ENGINE_get_first
1>libcurl.lib(openssl.c.obj) : error LNK2001: unresolved external symbol ENGINE_get_next
1>libcurl.lib(openssl.c.obj) : error LNK2001: unresolved external symbol ENGINE_by_id
1>libcurl.lib(openssl.c.obj) : error LNK2001: unresolved external symbol ENGINE_ctrl
1>libcurl.lib(openssl.c.obj) : error LNK2001: unresolved external symbol ENGINE_ctrl_cmd
1>libcurl.lib(openssl.c.obj) : error LNK2001: unresolved external symbol ENGINE_free
1>libcurl.lib(openssl.c.obj) : error LNK2001: unresolved external symbol ENGINE_get_id
1>libcurl.lib(openssl.c.obj) : error LNK2001: unresolved external symbol ENGINE_init
1>libcurl.lib(openssl.c.obj) : error LNK2001: unresolved external symbol ENGINE_finish
1>libcurl.lib(openssl.c.obj) : error LNK2001: unresolved external symbol ENGINE_load_private_key
1>libcurl.lib(openssl.c.obj) : error LNK2001: unresolved external symbol ENGINE_set_default
1>libcurl.lib(md5.c.obj) : error LNK2001: unresolved external symbol MD5_Init
1>libcurl.lib(md5.c.obj) : error LNK2001: unresolved external symbol MD5_Update
1>libcurl.lib(md5.c.obj) : error LNK2001: unresolved external symbol MD5_Final
1>libcurl.lib(curl_ntlm_core.c.obj) : error LNK2001: unresolved external symbol DES_ecb_encrypt
1>libcurl.lib(curl_ntlm_core.c.obj) : error LNK2001: unresolved external symbol DES_set_odd_parity
1>libcurl.lib(curl_ntlm_core.c.obj) : error LNK2001: unresolved external symbol DES_set_key_unchecked
1>libcurl.lib(sha256.c.obj) : error LNK2001: unresolved external symbol EVP_DigestInit_ex
1>C:\Src\MMO\mqnext\src\..\build\bin\release\MacroQuest.exe : fatal error LNK1120: 193 unresolved externals
1>Done building project "MacroQuest.vcxproj" -- FAILED.
========== Build: 0 succeeded, 1 failed, 0 up-to-date, 0 skipped ==========
Comments