doomgod icon

zandro

doomgod | PRO | 12/03/13 12:00:58 PM UTC | 0 ⭐ | 379 👁️ | Never ⏰ | []
text |

2.18 KB

|

None

|

0 👍

/

0 👎

1>------ Build started: Project: wadsrc, Configuration: Release Win32 ------
1>Checking zandronum.pk3...
1>Скопировано файлов:         1.
2>------ Build started: Project: masterserver, Configuration: Release Win32 ------
3>------ Build started: Project: rcon_utility, Configuration: Release Win32 ------
1>Build log was saved at "file://c:\doom\zandronum\wadsrc\Release\BuildLog.htm"
2>Performing Pre-Build Event...
1>wadsrc - 0 error(s), 0 warning(s)
4>------ Build started: Project: wadsrc_st, Configuration: Release Win32 ------
3>Getting SVN revision...
4>Checking skulltag_actors.pk3...
4>Скопировано файлов:         1.
4>Build log was saved at "file://c:\doom\zandronum\wadsrc_st\Release\BuildLog.htm"
4>wadsrc_st - 0 error(s), 0 warning(s)
5>------ Build started: Project: statsmaker, Configuration: Release Win32 ------
5>Compiling...
5>huffman.cpp
5>c1xx : fatal error C1083: Cannot open source file: '..\src\huffman.cpp': No such file or directory
5>Build log was saved at "file://c:\doom\zandronum\statsmaker\Release\BuildLog.htm"
5>statsmaker - 1 error(s), 0 warning(s)
2>c:\doom\zandronum\masterserver\svnrevision.h is up to date at revision 131127-1817.
2>Compiling...
2>network.cpp
3>c:\doom\zandronum\rcon_utility\svnrevision.h is up to date at revision 131127-1817.
3>Compiling...
3>network.cpp
2>.\network.cpp(61) : fatal error C1083: Cannot open include file: '../src/huffman.h': No such file or directory
2>huffman.cpp
2>c1xx : fatal error C1083: Cannot open source file: '..\src\huffman.cpp': No such file or directory
2>Generating Code...
2>Build log was saved at "file://c:\doom\zandronum\masterserver\Release\BuildLog.htm"
2>masterserver - 2 error(s), 0 warning(s)
3>..\masterserver\network.cpp(61) : fatal error C1083: Cannot open include file: '../src/huffman.h': No such file or directory
3>huffman.cpp
3>c1xx : fatal error C1083: Cannot open source file: '..\src\huffman.cpp': No such file or directory
3>Generating Code...
3>Build log was saved at "file://c:\doom\zandronum\rcon_utility\Release\BuildLog.htm"
3>rcon_utility - 2 error(s), 0 warning(s)
========== Build: 2 succeeded, 3 failed, 15 up-to-date, 0 skipped ==========

Comments