RobertBerger icon

CONFIG_WERROR

RobertBerger | PRO | 06/06/25 08:06:49 AM UTC | 0 ⭐ | 416 👁️ | Never ⏰ | []
text |

12.09 KB

|

None

|

0 👍

/

0 👎

ERROR: linux-yocto-custom-6.14.5-std-sec+git-r0 do_compile: oe_runmake failed
ERROR: linux-yocto-custom-6.14.5-std-sec+git-r0 do_compile: Execution of '/workdir/build/imx6q-phytec-mira-rdk-nand-wic-master/tmp/work/imx6q_phytec_mira_rdk_nand-resy-linux-gnueabi/linux-yocto-custom/6.14.5-std-sec+git/temp/run.do_compile.1126884' failed with exit code 1
ERROR: Logfile of failure stored in: /workdir/build/imx6q-phytec-mira-rdk-nand-wic-master/tmp/work/imx6q_phytec_mira_rdk_nand-resy-linux-gnueabi/linux-yocto-custom/6.14.5-std-sec+git/temp/log.do_compile.1126884
Log data follows: 
| DEBUG: Executing shell function do_compile 
| NOTE: KBUILD_BUILD_TIMESTAMP: Fri May  2 06:02:16 UTC 2025 
ERROR: Task (/workdir/sources/poky-master/../meta-multi-v7-ml-bsp-master/recipes-kernel/linux/linux-yocto-custom_6.14.5.bb:do_compile) failed with exit code '1'
| NOTE: make -j 12 CC=arm-resy-linux-gnueabi-gcc  -mno-thumb-interwork -marm  -fuse-ld=bfd  -ffile-prefix-map=/workdir/build/imx6q-phytec-mira-rdk-nand-wic-master/tmp/work-shared/imx6q-phytec-mira-rdk-nand/kernel-source=/usr/src/debug/linux-yocto-custom/6.14.5-std-sec+git  -ffile-prefix-map=/workdir/build/imx6q-phytec-mira-rdk-nand-wic-master/tmp/work/imx6q_phytec_mira_rdk_nand-resy-linux-gnueabi/linux-yocto-custom/6.14.5-std-sec+git/linux-imx6q_phytec_mira_rdk_nand-std-sec-build=/usr/src/debug/linux-yocto-custom/6.14.5-std-sec+git  -ffile-prefix-map=/workdir/build/imx6q-phytec-mira-rdk-nand-wic-master/tmp/work/imx6q_phytec_mira_rdk_nand-resy-linux-gnueabi/linux-yocto-custom/6.14.5-std-sec+git/recipe-sysroot=  -ffile-prefix-map=/workdir/build/imx6q-phytec-mira-rdk-nand-wic-master/tmp/work/imx6q_phytec_mira_rdk_nand-resy-linux-gnueabi/linux-yocto-custom/6.14.5-std-sec+git/recipe-sysroot-native=   -ffile-prefix-map=/workdir/build/imx6q-phytec-mira-rdk-nand-wic-master/tmp/work-shared/imx6q-phytec-mira-rdk-nand/kernel-source=/usr/src/kernel  -ffile-prefix-map=/workdir/build/imx6q-phytec-mira-rdk-nand-wic-master/tmp/work-shared/imx6q-phytec-mira-rdk-nand/kernel-build-artifacts=/usr/src/kernel  LD=arm-resy-linux-gnueabi-ld.bfd   OBJCOPY=arm-resy-linux-gnueabi-objcopy  STRIP=arm-resy-linux-gnueabi-strip HOSTCC=gcc  HOSTCFLAGS=-isystem/workdir/build/imx6q-phytec-mira-rdk-nand-wic-master/tmp/work/imx6q_phytec_mira_rdk_nand-resy-linux-gnueabi/linux-yocto-custom/6.14.5-std-sec+git/recipe-sysroot-native/usr/include -O2 -pipe HOSTLDFLAGS=-L/workdir/build/imx6q-phytec-mira-rdk-nand-wic-master/tmp/work/imx6q_phytec_mira_rdk_nand-resy-linux-gnueabi/linux-yocto-custom/6.14.5-std-sec+git/recipe-sysroot-native/usr/lib                         -L/workdir/build/imx6q-phytec-mira-rdk-nand-wic-master/tmp/work/imx6q_phytec_mira_rdk_nand-resy-linux-gnueabi/linux-yocto-custom/6.14.5-std-sec+git/recipe-sysroot-native/lib                         -Wl,--enable-new-dtags                         -Wl,-rpath-link,/workdir/build/imx6q-phytec-mira-rdk-nand-wic-master/tmp/work/imx6q_phytec_mira_rdk_nand-resy-linux-gnueabi/linux-yocto-custom/6.14.5-std-sec+git/recipe-sysroot-native/usr/lib                         -Wl,-rpath-link,/workdir/build/imx6q-phytec-mira-rdk-nand-wic-master/tmp/work/imx6q_phytec_mira_rdk_nand-resy-linux-gnueabi/linux-yocto-custom/6.14.5-std-sec+git/recipe-sysroot-native/lib                         -Wl,-rpath,/workdir/build/imx6q-phytec-mira-rdk-nand-wic-master/tmp/work/imx6q_phytec_mira_rdk_nand-resy-linux-gnueabi/linux-yocto-custom/6.14.5-std-sec+git/recipe-sysroot-native/usr/lib                         -Wl,-rpath,/workdir/build/imx6q-phytec-mira-rdk-nand-wic-master/tmp/work/imx6q_phytec_mira_rdk_nand-resy-linux-gnueabi/linux-yocto-custom/6.14.5-std-sec+git/recipe-sysroot-native/lib                         -Wl,-O1 -Wl,--allow-shlib-undefined -Wl,--dynamic-linker=/workdir/build/imx6q-phytec-mira-rdk-nand-wic-master/tmp/sysroots-uninative/x86_64-linux/lib/ld-linux-x86-64.so.2 -pthread HOSTCPP=gcc  -E HOSTCXX=g++  HOSTCXXFLAGS=-isystem/workdir/build/imx6q-phytec-mira-rdk-nand-wic-master/tmp/work/imx6q_phytec_mira_rdk_nand-resy-linux-gnueabi/linux-yocto-custom/6.14.5-std-sec+git/recipe-sysroot-native/usr/include -O2 -pipe HOSTPKG_CONFIG=pkg-config-native PAHOLE=false -j 12 uImage LOADADDR=0x0 UIMAGE_TYPE=kernel_noload 
|   GEN     Makefile 
|   CALL    /workdir/build/imx6q-phytec-mira-rdk-nand-wic-master/tmp/work-shared/imx6q-phytec-mira-rdk-nand/kernel-source/scripts/checksyscalls.sh 
|   CC      drivers/pmdomain/imx/gpc.o 
|   CC      drivers/virtio/virtio.o 
|   CC      drivers/pmdomain/mediatek/mtk-scpsys.o 
|   CC      drivers/pmdomain/mediatek/mtk-pm-domains.o 
|   CC      drivers/virtio/virtio_ring.o 
|   CC      drivers/pmdomain/mediatek/airoha-cpu-pmdomain.o 
|   CC      drivers/pmdomain/imx/gpcv2.o 
|   CC      drivers/regulator/core.o 
|   CC      drivers/regulator/dummy.o 
|   CC      drivers/regulator/fixed-helper.o 
|   CC      drivers/regulator/helpers.o 
| /workdir/build/imx6q-phytec-mira-rdk-nand-wic-master/tmp/work-shared/imx6q-phytec-mira-rdk-nand/kernel-source/drivers/pmdomain/imx/gpc.c:227:11: error: initializer-string for array of 'char' truncates NUL terminator but destination lacks 'nonstring' attribute (21 chars into 20 available) [-Werror=unterminated-string-initialization] 
|   227 |         { "imx-pgc-power-domain"}, 
|       |           ^~~~~~~~~~~~~~~~~~~~~~ 
|   CC      drivers/regulator/devres.o 
|   CC      drivers/regulator/irq_helpers.o 
| cc1: all warnings being treated as errors 
| make[5] *** [/workdir/build/imx6q-phytec-mira-rdk-nand-wic-master/tmp/work-shared/imx6q-phytec-mira-rdk-nand/kernel-source/scripts/Makefile.build:207: drivers/pmdomain/imx/gpc.o] Error 1 
| make[5] *** Waiting for unfinished jobs.... 
|   CC      drivers/virtio/virtio_anchor.o 
| make[4] *** [/workdir/build/imx6q-phytec-mira-rdk-nand-wic-master/tmp/work-shared/imx6q-phytec-mira-rdk-nand/kernel-source/scripts/Makefile.build:465: drivers/pmdomain/imx] Error 2 
| make[4] *** Waiting for unfinished jobs.... 
|   CC      drivers/virtio/virtio_pci_modern_dev.o 
|   CC      drivers/virtio/virtio_pci_legacy_dev.o 
|   CC      drivers/virtio/virtio_mmio.o 
|   CC      drivers/regulator/of_regulator.o 
|   AR      drivers/pmdomain/mediatek/built-in.a 
| make[3] *** [/workdir/build/imx6q-phytec-mira-rdk-nand-wic-master/tmp/work-shared/imx6q-phytec-mira-rdk-nand/kernel-source/scripts/Makefile.build:465: drivers/pmdomain] Error 2 
| make[3] *** Waiting for unfinished jobs.... 
|   CC      drivers/regulator/fixed.o 
|   CC      drivers/virtio/virtio_pci_modern.o 
|   CC      drivers/virtio/virtio_pci_common.o 
|   CC      drivers/regulator/cpcap-regulator.o 
|   CC      drivers/regulator/ab8500-ext.o 
|   CC      drivers/regulator/ab8500.o 
|   CC      drivers/regulator/act8865-regulator.o 
|   CC      drivers/virtio/virtio_pci_legacy.o 
|   CC      drivers/regulator/act8945a-regulator.o 
|   CC      drivers/regulator/anatop-regulator.o 
|   CC      drivers/regulator/scmi-regulator.o 
|   CC      drivers/regulator/as3711-regulator.o 
|   CC      drivers/regulator/as3722-regulator.o 
|   CC      drivers/regulator/axp20x-regulator.o 
|   CC      drivers/regulator/bcm590xx-regulator.o 
|   CC      drivers/regulator/da9062-regulator.o 
|   AR      drivers/virtio/built-in.a 
|   CC      drivers/regulator/da9063-regulator.o 
|   CC      drivers/regulator/da9210-regulator.o 
|   CC      drivers/regulator/dbx500-prcmu.o 
|   CC      drivers/regulator/db8500-prcmu.o 
|   CC      drivers/regulator/fan53555.o 
|   CC      drivers/regulator/gpio-regulator.o 
|   CC      drivers/regulator/lp872x.o 
|   CC      drivers/regulator/max8907-regulator.o 
|   CC      drivers/regulator/max8973-regulator.o 
|   CC      drivers/regulator/max77686-regulator.o 
|   CC      drivers/regulator/max77802-regulator.o 
|   CC      drivers/regulator/qcom_rpm-regulator.o 
|   CC      drivers/regulator/qcom_smd-regulator.o 
|   CC      drivers/regulator/qcom_spmi-regulator.o 
|   CC      drivers/regulator/palmas-regulator.o 
|   CC      drivers/regulator/pwm-regulator.o 
|   CC      drivers/regulator/tps51632-regulator.o 
|   CC      drivers/regulator/pbias-regulator.o 
|   CC      drivers/regulator/rk808-regulator.o 
|   CC      drivers/regulator/rn5t618-regulator.o 
|   CC      drivers/regulator/s2mps11.o 
|   CC      drivers/regulator/s5m8767.o 
|   CC      drivers/regulator/stm32-pwr.o 
|   CC      drivers/regulator/stpmic1_regulator.o 
|   CC      drivers/regulator/sun20i-regulator.o 
|   CC      drivers/regulator/ti-abb-regulator.o 
|   CC      drivers/regulator/tps62360-regulator.o 
|   CC      drivers/regulator/tps65090-regulator.o 
|   CC      drivers/regulator/tps65217-regulator.o 
|   CC      drivers/regulator/tps65218-regulator.o 
|   CC      drivers/regulator/tps6586x-regulator.o 
|   CC      drivers/regulator/tps65910-regulator.o 
|   CC      drivers/regulator/twl-regulator.o 
|   CC      drivers/regulator/twl6030-regulator.o 
|   CC      drivers/regulator/uniphier-regulator.o 
|   CC      drivers/regulator/vexpress-regulator.o 
|   AR      drivers/regulator/built-in.a 
| make[2] *** [/workdir/build/imx6q-phytec-mira-rdk-nand-wic-master/tmp/work-shared/imx6q-phytec-mira-rdk-nand/kernel-source/scripts/Makefile.build:465: drivers] Error 2 
| make[1] *** [/workdir/build/imx6q-phytec-mira-rdk-nand-wic-master/tmp/work-shared/imx6q-phytec-mira-rdk-nand/kernel-source/Makefile:1997: .] Error 2 
| make: *** [/workdir/build/imx6q-phytec-mira-rdk-nand-wic-master/tmp/work-shared/imx6q-phytec-mira-rdk-nand/kernel-source/Makefile:251: __sub-make] Error 2 
| ERROR: oe_runmake failed 
| WARNING: /workdir/build/imx6q-phytec-mira-rdk-nand-wic-master/tmp/work/imx6q_phytec_mira_rdk_nand-resy-linux-gnueabi/linux-yocto-custom/6.14.5-std-sec+git/temp/run.do_compile.1126884:307 exit 1 from 'exit 1' 
| WARNING: Backtrace (BB generated script): 
|       #1: bbfatal_log, /workdir/build/imx6q-phytec-mira-rdk-nand-wic-master/tmp/work/imx6q_phytec_mira_rdk_nand-resy-linux-gnueabi/linux-yocto-custom/6.14.5-std-sec+git/temp/run.do_compile.1126884, line 307 
|       #2: die, /workdir/build/imx6q-phytec-mira-rdk-nand-wic-master/tmp/work/imx6q_phytec_mira_rdk_nand-resy-linux-gnueabi/linux-yocto-custom/6.14.5-std-sec+git/temp/run.do_compile.1126884, line 291 
|       #3: oe_runmake, /workdir/build/imx6q-phytec-mira-rdk-nand-wic-master/tmp/work/imx6q_phytec_mira_rdk_nand-resy-linux-gnueabi/linux-yocto-custom/6.14.5-std-sec+git/temp/run.do_compile.1126884, line 219 
|       #4: kernel_do_compile, /workdir/build/imx6q-phytec-mira-rdk-nand-wic-master/tmp/work/imx6q_phytec_mira_rdk_nand-resy-linux-gnueabi/linux-yocto-custom/6.14.5-std-sec+git/temp/run.do_compile.1126884, line 203 
|       #5: do_compile, /workdir/build/imx6q-phytec-mira-rdk-nand-wic-master/tmp/work/imx6q_phytec_mira_rdk_nand-resy-linux-gnueabi/linux-yocto-custom/6.14.5-std-sec+git/temp/run.do_compile.1126884, line 149 
|       #6: main, /workdir/build/imx6q-phytec-mira-rdk-nand-wic-master/tmp/work/imx6q_phytec_mira_rdk_nand-resy-linux-gnueabi/linux-yocto-custom/6.14.5-std-sec+git/temp/run.do_compile.1126884, line 311 
NOTE: recipe linux-yocto-custom-6.14.5-std-sec+git-r0: task do_compile: Failed 
NOTE: Tasks Summary: Attempted 6228 tasks of which 6227 didn't need to be rerun and 1 failed. 
NOTE: The errors for this build are stored in /workdir/build/imx6q-phytec-mira-rdk-nand-wic-master/tmp/log/error-report/error_report_20250606080059.txt 
You can send the errors to a reports server by running: 
  send-error-report /workdir/build/imx6q-phytec-mira-rdk-nand-wic-master/tmp/log/error-report/error_report_20250606080059.txt [-s server] 
NOTE: The contents of these logs will be posted in public if you use the above command with the default server. Please ensure you remove any identifying or proprietary information when prompted before sending. 
NOTE: Writing buildhistory 
NOTE: Writing buildhistory took: 2 seconds 
 Summary: 1 task failed: 
  /workdir/sources/poky-master/../meta-multi-v7-ml-bsp-master/recipes-kernel/linux/linux-yocto-custom_6.14.5.bb:do_compile 
    log: /workdir/build/imx6q-phytec-mira-rdk-nand-wic-master/tmp/work/imx6q_phytec_mira_rdk_nand-resy-linux-gnueabi/linux-yocto-custom/6.14.5-std-sec+git/temp/log.do_compile.1126884 
Summary: There were 2 ERROR messages, returning a non-zero exit code. 
 

Comments