doomgod icon

Zandronum compile error

doomgod | PRO | 10/22/13 07:37:57 AM UTC | 0 ⭐ | 422 👁️ | Never ⏰ | []
text |

13.37 KB

|

None

|

0 👍

/

0 👎

------ Build started: Project: gdtoa, Configuration: Release Win32 ------
  dmisc.c
c:\doom\zandronum\gdtoa\gdtoa.h(131): error C2373: 'strtof' : redefinition; different type modifiers
          C:\Program Files\Microsoft Visual Studio 12.0\VC\include\stdlib.h(554) : see declaration of 'strtof'
  dtoa.c
c:\doom\zandronum\gdtoa\gdtoa.h(131): error C2373: 'strtof' : redefinition; different type modifiers
          C:\Program Files\Microsoft Visual Studio 12.0\VC\include\stdlib.h(554) : see declaration of 'strtof'
  g__fmt.c
c:\doom\zandronum\gdtoa\gdtoa.h(131): error C2373: 'strtof' : redefinition; different type modifiers
          C:\Program Files\Microsoft Visual Studio 12.0\VC\include\stdlib.h(554) : see declaration of 'strtof'
  g_ddfmt.c
c:\doom\zandronum\gdtoa\gdtoa.h(131): error C2373: 'strtof' : redefinition; different type modifiers
          C:\Program Files\Microsoft Visual Studio 12.0\VC\include\stdlib.h(554) : see declaration of 'strtof'
  g_dfmt.c
c:\doom\zandronum\gdtoa\gdtoa.h(131): error C2373: 'strtof' : redefinition; different type modifiers
          C:\Program Files\Microsoft Visual Studio 12.0\VC\include\stdlib.h(554) : see declaration of 'strtof'
  g_ffmt.c
c:\doom\zandronum\gdtoa\gdtoa.h(131): error C2373: 'strtof' : redefinition; different type modifiers
          C:\Program Files\Microsoft Visual Studio 12.0\VC\include\stdlib.h(554) : see declaration of 'strtof'
  g_Qfmt.c
c:\doom\zandronum\gdtoa\gdtoa.h(131): error C2373: 'strtof' : redefinition; different type modifiers
          C:\Program Files\Microsoft Visual Studio 12.0\VC\include\stdlib.h(554) : see declaration of 'strtof'
  g_xfmt.c
c:\doom\zandronum\gdtoa\gdtoa.h(131): error C2373: 'strtof' : redefinition; different type modifiers
          C:\Program Files\Microsoft Visual Studio 12.0\VC\include\stdlib.h(554) : see declaration of 'strtof'
  g_xLfmt.c
c:\doom\zandronum\gdtoa\gdtoa.h(131): error C2373: 'strtof' : redefinition; different type modifiers
          C:\Program Files\Microsoft Visual Studio 12.0\VC\include\stdlib.h(554) : see declaration of 'strtof'
  gdtoa.c
c:\doom\zandronum\gdtoa\gdtoa.h(131): error C2373: 'strtof' : redefinition; different type modifiers
          C:\Program Files\Microsoft Visual Studio 12.0\VC\include\stdlib.h(554) : see declaration of 'strtof'
  gethex.c
c:\doom\zandronum\gdtoa\gdtoa.h(131): error C2373: 'strtof' : redefinition; different type modifiers
          C:\Program Files\Microsoft Visual Studio 12.0\VC\include\stdlib.h(554) : see declaration of 'strtof'
  gmisc.c
c:\doom\zandronum\gdtoa\gdtoa.h(131): error C2373: 'strtof' : redefinition; different type modifiers
          C:\Program Files\Microsoft Visual Studio 12.0\VC\include\stdlib.h(554) : see declaration of 'strtof'
  hd_init.c
c:\doom\zandronum\gdtoa\gdtoa.h(131): error C2373: 'strtof' : redefinition; different type modifiers
          C:\Program Files\Microsoft Visual Studio 12.0\VC\include\stdlib.h(554) : see declaration of 'strtof'
  hexnan.c
c:\doom\zandronum\gdtoa\gdtoa.h(131): error C2373: 'strtof' : redefinition; different type modifiers
          C:\Program Files\Microsoft Visual Studio 12.0\VC\include\stdlib.h(554) : see declaration of 'strtof'
  misc.c
c:\doom\zandronum\gdtoa\gdtoa.h(131): error C2373: 'strtof' : redefinition; different type modifiers
          C:\Program Files\Microsoft Visual Studio 12.0\VC\include\stdlib.h(554) : see declaration of 'strtof'
  smisc.c
c:\doom\zandronum\gdtoa\gdtoa.h(131): error C2373: 'strtof' : redefinition; different type modifiers
          C:\Program Files\Microsoft Visual Studio 12.0\VC\include\stdlib.h(554) : see declaration of 'strtof'
  strtod.c
c:\doom\zandronum\gdtoa\gdtoa.h(131): error C2373: 'strtof' : redefinition; different type modifiers
          C:\Program Files\Microsoft Visual Studio 12.0\VC\include\stdlib.h(554) : see declaration of 'strtof'
  strtodg.c
c:\doom\zandronum\gdtoa\gdtoa.h(131): error C2373: 'strtof' : redefinition; different type modifiers
          C:\Program Files\Microsoft Visual Studio 12.0\VC\include\stdlib.h(554) : see declaration of 'strtof'
  strtodI.c
c:\doom\zandronum\gdtoa\gdtoa.h(131): error C2373: 'strtof' : redefinition; different type modifiers
          C:\Program Files\Microsoft Visual Studio 12.0\VC\include\stdlib.h(554) : see declaration of 'strtof'
  strtof.c
c:\doom\zandronum\gdtoa\gdtoa.h(131): error C2373: 'strtof' : redefinition; different type modifiers
          C:\Program Files\Microsoft Visual Studio 12.0\VC\include\stdlib.h(554) : see declaration of 'strtof'
strtof.c(40): error C2373: 'strtof' : redefinition; different type modifiers
          C:\Program Files\Microsoft Visual Studio 12.0\VC\include\stdlib.h(554) : see declaration of 'strtof'
  Generating Code...
  Compiling...
  strtoId.c
c:\doom\zandronum\gdtoa\gdtoa.h(131): error C2373: 'strtof' : redefinition; different type modifiers
          C:\Program Files\Microsoft Visual Studio 12.0\VC\include\stdlib.h(554) : see declaration of 'strtof'
  strtoIdd.c
c:\doom\zandronum\gdtoa\gdtoa.h(131): error C2373: 'strtof' : redefinition; different type modifiers
          C:\Program Files\Microsoft Visual Studio 12.0\VC\include\stdlib.h(554) : see declaration of 'strtof'
  strtoIf.c
c:\doom\zandronum\gdtoa\gdtoa.h(131): error C2373: 'strtof' : redefinition; different type modifiers
          C:\Program Files\Microsoft Visual Studio 12.0\VC\include\stdlib.h(554) : see declaration of 'strtof'
  strtoIg.c
c:\doom\zandronum\gdtoa\gdtoa.h(131): error C2373: 'strtof' : redefinition; different type modifiers
          C:\Program Files\Microsoft Visual Studio 12.0\VC\include\stdlib.h(554) : see declaration of 'strtof'
  strtoIQ.c
c:\doom\zandronum\gdtoa\gdtoa.h(131): error C2373: 'strtof' : redefinition; different type modifiers
          C:\Program Files\Microsoft Visual Studio 12.0\VC\include\stdlib.h(554) : see declaration of 'strtof'
  strtoIx.c
c:\doom\zandronum\gdtoa\gdtoa.h(131): error C2373: 'strtof' : redefinition; different type modifiers
          C:\Program Files\Microsoft Visual Studio 12.0\VC\include\stdlib.h(554) : see declaration of 'strtof'
  strtoIxL.c
c:\doom\zandronum\gdtoa\gdtoa.h(131): error C2373: 'strtof' : redefinition; different type modifiers
          C:\Program Files\Microsoft Visual Studio 12.0\VC\include\stdlib.h(554) : see declaration of 'strtof'
  strtopd.c
c:\doom\zandronum\gdtoa\gdtoa.h(131): error C2373: 'strtof' : redefinition; different type modifiers
          C:\Program Files\Microsoft Visual Studio 12.0\VC\include\stdlib.h(554) : see declaration of 'strtof'
  strtopdd.c
c:\doom\zandronum\gdtoa\gdtoa.h(131): error C2373: 'strtof' : redefinition; different type modifiers
          C:\Program Files\Microsoft Visual Studio 12.0\VC\include\stdlib.h(554) : see declaration of 'strtof'
  strtopf.c
c:\doom\zandronum\gdtoa\gdtoa.h(131): error C2373: 'strtof' : redefinition; different type modifiers
          C:\Program Files\Microsoft Visual Studio 12.0\VC\include\stdlib.h(554) : see declaration of 'strtof'
  strtopQ.c
c:\doom\zandronum\gdtoa\gdtoa.h(131): error C2373: 'strtof' : redefinition; different type modifiers
          C:\Program Files\Microsoft Visual Studio 12.0\VC\include\stdlib.h(554) : see declaration of 'strtof'
  strtopx.c
c:\doom\zandronum\gdtoa\gdtoa.h(131): error C2373: 'strtof' : redefinition; different type modifiers
          C:\Program Files\Microsoft Visual Studio 12.0\VC\include\stdlib.h(554) : see declaration of 'strtof'
  strtopxL.c
c:\doom\zandronum\gdtoa\gdtoa.h(131): error C2373: 'strtof' : redefinition; different type modifiers
          C:\Program Files\Microsoft Visual Studio 12.0\VC\include\stdlib.h(554) : see declaration of 'strtof'
  strtord.c
c:\doom\zandronum\gdtoa\gdtoa.h(131): error C2373: 'strtof' : redefinition; different type modifiers
          C:\Program Files\Microsoft Visual Studio 12.0\VC\include\stdlib.h(554) : see declaration of 'strtof'
  strtordd.c
c:\doom\zandronum\gdtoa\gdtoa.h(131): error C2373: 'strtof' : redefinition; different type modifiers
          C:\Program Files\Microsoft Visual Studio 12.0\VC\include\stdlib.h(554) : see declaration of 'strtof'
  strtorf.c
c:\doom\zandronum\gdtoa\gdtoa.h(131): error C2373: 'strtof' : redefinition; different type modifiers
          C:\Program Files\Microsoft Visual Studio 12.0\VC\include\stdlib.h(554) : see declaration of 'strtof'
  strtorQ.c
c:\doom\zandronum\gdtoa\gdtoa.h(131): error C2373: 'strtof' : redefinition; different type modifiers
          C:\Program Files\Microsoft Visual Studio 12.0\VC\include\stdlib.h(554) : see declaration of 'strtof'
  strtorx.c
c:\doom\zandronum\gdtoa\gdtoa.h(131): error C2373: 'strtof' : redefinition; different type modifiers
          C:\Program Files\Microsoft Visual Studio 12.0\VC\include\stdlib.h(554) : see declaration of 'strtof'
  strtorxL.c
c:\doom\zandronum\gdtoa\gdtoa.h(131): error C2373: 'strtof' : redefinition; different type modifiers
          C:\Program Files\Microsoft Visual Studio 12.0\VC\include\stdlib.h(554) : see declaration of 'strtof'
  sum.c
c:\doom\zandronum\gdtoa\gdtoa.h(131): error C2373: 'strtof' : redefinition; different type modifiers
          C:\Program Files\Microsoft Visual Studio 12.0\VC\include\stdlib.h(554) : see declaration of 'strtof'
  Generating Code...
  Compiling...
  ulp.c
c:\doom\zandronum\gdtoa\gdtoa.h(131): error C2373: 'strtof' : redefinition; different type modifiers
          C:\Program Files\Microsoft Visual Studio 12.0\VC\include\stdlib.h(554) : see declaration of 'strtof'
  Generating Code...
------ Build started: Project: zandronum, Configuration: Release Win32 ------
  src/svnrevision.h is up to date at revision 131020-1957M.
  r_things.cpp
src\r_things.cpp(1232): warning C4244: '=' : conversion from 'double' to 'fixed_t', possible loss of data
src\r_things.cpp(1234): warning C4244: '*=' : conversion from 'float' to 'fixed_t', possible loss of data
src\r_things.cpp(1241): warning C4244: '=' : conversion from 'double' to 'fixed_t', possible loss of data
src\r_things.cpp(1243): warning C4244: '*=' : conversion from 'float' to 'fixed_t', possible loss of data
src\r_things.cpp(1063): warning C4101: 'lump' : unreferenced local variable
src\r_things.cpp(1809): warning C4018: '<' : signed/unsigned mismatch
C:\Program Files\Microsoft Visual Studio 12.0\VC\include\utility(28): error C2668: 'std::swap' : ambiguous call to overloaded function
          C:\Program Files\Microsoft Visual Studio 12.0\VC\include\exception(492): could be 'void std::swap(std::exception_ptr &,std::exception_ptr &)'
          c:\doom\zandronum\src\templates.h(205): or       'void swap<vissprite_t*>(T &,T &)' [found using argument-dependent lookup]
          with
          [
              T=vissprite_t *
          ]
          C:\Program Files\Microsoft Visual Studio 12.0\VC\include\utility(48): or       'void std::swap<vissprite_t*>(_Ty &,_Ty &)'
          with
          [
              _Ty=vissprite_t *
          ]
          while trying to match the argument list '(vissprite_t *, vissprite_t *)'
          C:\Program Files\Microsoft Visual Studio 12.0\VC\include\algorithm(2916) : see reference to function template instantiation 'void std::iter_swap<_BidIt,_BidIt>(_FwdIt1,_FwdIt2)' being compiled
          with
          [
              _BidIt=vissprite_t **
  ,            _FwdIt1=vissprite_t **
  ,            _FwdIt2=vissprite_t **
          ]
          C:\Program Files\Microsoft Visual Studio 12.0\VC\include\algorithm(3252) : see reference to function template instantiation 'void std::_Buffered_merge<_BidIt,_Diff,_Ty,bool(__fastcall *)(vissprite_t *,vissprite_t *)>(_BidIt,_BidIt,_BidIt,_Diff,_Diff,std::_Temp_iterator<_Ty> &,_Pr)' being compiled
          with
          [
              _BidIt=vissprite_t **
  ,            _Diff=std::iterator_traits<vissprite_t **>::difference_type
  ,            _Ty=vissprite_t *
  ,            _Pr=bool (__fastcall *)(vissprite_t *,vissprite_t *)
          ]
          C:\Program Files\Microsoft Visual Studio 12.0\VC\include\algorithm(3265) : see reference to function template instantiation 'void std::_Stable_sort<_BidIt,_Diff,_Ty,bool(__fastcall *)(vissprite_t *,vissprite_t *)>(_BidIt,_BidIt,_Diff,std::_Temp_iterator<_Ty> &,_Pr)' being compiled
          with
          [
              _BidIt=vissprite_t **
  ,            _Diff=std::iterator_traits<vissprite_t **>::difference_type
  ,            _Ty=vissprite_t *
  ,            _Pr=bool (__fastcall *)(vissprite_t *,vissprite_t *)
          ]
          C:\Program Files\Microsoft Visual Studio 12.0\VC\include\algorithm(3276) : see reference to function template instantiation 'void std::_Stable_sort<_Iter,std::iterator_traits<_Iter>::difference_type,vissprite_t*,bool(__fastcall *)(vissprite_t *,vissprite_t *)>(_BidIt,_BidIt,_Diff *,_Ty *,_Pr)' being compiled
          with
          [
              _Iter=vissprite_t **
  ,            _BidIt=vissprite_t **
  ,            _Diff=std::iterator_traits<vissprite_t **>::difference_type
  ,            _Ty=vissprite_t *
  ,            _Pr=bool (__fastcall *)(vissprite_t *,vissprite_t *)
          ]
          src\r_things.cpp(2468) : see reference to function template instantiation 'void std::stable_sort<vissprite_t**,bool(__fastcall *)(vissprite_t *,vissprite_t *)>(_BidIt,_BidIt,_Pr)' being compiled
          with
          [
              _BidIt=vissprite_t **
  ,            _Pr=bool (__fastcall *)(vissprite_t *,vissprite_t *)
          ]
========== Build: 0 succeeded, 2 failed, 18 up-to-date, 0 skipped ==========

Comments