cevilio icon

Build project error

cevilio | PRO | 07/05/18 08:50:29 AM UTC | 0 ⭐ | 267 👁️ | Never ⏰ | []
C++ |

2.56 KB

|

None

|

0 👍

/

0 👎

/Applications/CLion.app/Contents/bin/cmake/bin/cmake --build /Users/vchar/OneDrive/eos/cmake-build-debug --target all -- -j 4
[  0%] Built target asmjs
[  0%] Built target ast
[  0%] Built target binaryen
[  0%] Built target wasm
[  0%] Built target cfg
[  0%] Built target emscripten-optimizer
[  1%] Built target support
[  4%] Built target passes
[  5%] Built target builtins
[  6%] Built target Platform
[ 28%] Built target softfloat
[ 28%] Built target chainbase
[ 30%] Built target libc++
[ 30%] Built target eosiolib
[ 30%] contract...
[ 30%] Built target appbase
[ 30%] Built target identity_common
[ 71%] Built target libc
[ 71%] Built target copy_skeleton_contract
[ 71%] Built target identity_interface
[ 71%] Built target eosio-s2wasm
[ 71%] Built target Logging
[ 71%] Built target print_floats
[ 71%] Built target IR
[ 71%] Built target chainbase_test
[ 71%] Built target Runtime
[ 71%] Built target WASM
[ 71%] Built target Emscripten
[ 71%] Built target appbase_example
[ 71%] Built target WAST
[ 71%] Built target eosio-wast2wasm
[ 73%] Built target wavm
[ 73%] Built target Test
[ 73%] Built target Disassemble
[ 75%] Built target simple.token
[ 75%] Built target eosio.bios
[ 75%] Built target eosio.msig
[ 76%] Built target multi_index_test
[ 76%] Built target eosio.token
[ 76%] Built target stltest
[ 76%] Built target identity_test
[ 77%] Built target identity
[ 77%] Built target hello
[ 77%] Built target test.inline
[ 78%] Built target exchange
[ 78%] Built target infinite
[ 79%] Built target asserter
[ 80%] Built target proxy
[ 80%] Built target test_api_mem
[ 81%] Built target test_api
[ 81%] Built target test_api_db
[ 82%] Built target test_api_multi_index
[ 83%] Built target test_ram_limit
[ 83%] Built target noop
[ 83%] Built target tic_tac_toe
[ 83%] Built target dice
[ 84%] Built target payloadless
[ 85%] Built target eosio.system
[ 89%] Built target fc
[ 89%] Linking CXX executable test_exchange
Undefined symbols for architecture x86_64:
  "init_unit_test_suite(int, char**)", referenced from:
      _main in libboost_unit_test_framework-mt.a(unit_test_main.o)
ld: symbol(s) not found for architecture x86_64
clang-4.0: error: linker command failed with exit code 1 (use -v to see invocation)
make[2]: *** [contracts/exchange/test_exchange] Error 1
make[1]: *** [contracts/exchange/CMakeFiles/test_exchange.dir/all] Error 2
make[1]: *** Waiting for unfinished jobs....
[ 89%] Built target eos_utilities
[ 89%] Built target test_cypher_suites
[ 90%] Built target eosio-applesedemo
make: *** [all] Error 2

Comments